{"text_format":"1","workbook":"xlsx","n_sheets":4,"sheets":["OPPLE TCO Calculation","PIM export","Supporting sheet","Equivalents"],"not_rendered":{"charts":4,"images":7,"macros":1,"external_links":0,"defined_names":2,"comments":1,"pivot_tables":0},"unopened":[],"bounds":{"document_bytes":16777216,"sheet_cells":100000,"rows_first":2000,"rows_last":500,"rows_between":2000,"halvings":0,"cell_chars":16384,"cell_head_chars":4096},"cells_cut":0,"cells_raw":0,"read":"whole","date_system":"1900"}

{"sheet":"OPPLE TCO Calculation","index":0,"n_rows":43,"n_cols":9,"rows_kept":43,"cut":false,"hidden":false,"merged":[[40,1,40,2],[41,1,41,2],[42,1,42,2],[39,1,39,2],[22,7,22,8],[15,7,15,8],[15,1,15,5],[35,4,35,5],[36,4,36,5],[37,4,37,5],[35,1,35,2],[36,1,36,2],[37,1,37,2],[34,4,34,5],[34,1,34,2],[33,1,33,5],[9,4,9,5],[9,1,9,2],[1,4,1,5],[22,1,22,5],[14,1,14,5],[6,1,7,2]]}
[]
[null,null,null,null,"Basic project data"]
[null,null,null,null,"Working hours per day",null,null,"Input required"]
[null,null,null,null,"Working days per week",null,null,"Input field"]
[null,null,null,null,"Working weeks per year",null,null,"Automatically generated field"]
[null,null,null,null,"Operating hours per year",{"$f":"F3*F4*F5","v":0},null,"Current sytem"]
[null,"TCO CALCULATION  ",null,null,"Electricity costs (€/kWh)"]
[null,null,null,null,"CO2 factor",265]
[]
[null,"Project information",null,null,"Custom names per alternative"]
[null,"Customer","<Customer name>",null,"Option A"]
[null,"Project","<Project name>",null,"Option B"]
[null,"Account manager","<Account manager name>",null,"Option C"]
[]
[null,"Product specifications"]
[null,"Manual input",null,null,null,null,null,"Custom Current system input"]
[null,null,"Current system",{"$f":"IF(F11=\"\",E11,F11)","v":"Option A"},{"$f":"IF(F12=\"\",E12,F12)","v":"Option B"},{"$f":"IF(F13=\"\",E13,F13)","v":"Option C"},null,"System description",""]
[null,"Product code/type","Select current system","Paste/type product code"," "," ",null,{"$f":"B25","v":"Lumen Output"},0]
[null,"Total number of lamps/luminaires",null,null,null,null,null,{"$f":"B27","v":"Rated Power (incl. driver loss)"},0]
[null,"Price per lamp/luminaire",null,null,null,null,null,{"$f":"B28","v":"Lifetime Burning Hours (L70)"},0]
[null,"Total Installation/relamping costs"]
[]
[null,"Automatic input",null,null,null,null,null,"Smart savings"]
[null,"Product description",{"$f":"IF(C18=\"Custom\",IF(I17=\"\",\"\",I17),C18)","v":"Select current system"},{"$f":"'Supporting sheet'!N13","v":0},{"$f":"'Supporting sheet'!N14","v":0},{"$f":"'Supporting sheet'!N15","v":0},null,"Expected savings due to use of Smart Sensors",0.2]
[null,"Lumen Output",{"$f":"VLOOKUP(C18,Equivalents!A:G,7,FALSE)","v":0},{"$f":"'Supporting sheet'!C13","v":0},{"$f":"'Supporting sheet'!C14","v":0},{"$f":"'Supporting sheet'!C15","v":0}]
[null,"Lumen Output Total",{"$f":"C25*C19","v":0},{"$f":"D25*D19","v":0},{"$f":"E25*E19","v":0},{"$f":"F25*F19","v":0}]
[null,"Rated Power (incl. driver loss)",{"$f":"VLOOKUP(C18,Equivalents!A:F,4,FALSE)","v":0},{"$f":"'Supporting sheet'!D13","v":0},{"$f":"'Supporting sheet'!D14","v":0},{"$f":"'Supporting sheet'!D15","v":0}]
[null,"Lifetime Burning Hours (L70)",{"$f":"VLOOKUP(C18,Equivalents!A:H,8,FALSE)","v":0},{"$f":"'Supporting sheet'!E13","v":0},{"$f":"'Supporting sheet'!E14","v":0},{"$f":"'Supporting sheet'!E15","v":0}]
[null,"Luminaire/lamp lifetime expectancy",{"$f":"C28/F6","v":{"$error":"#DIV/0!"}},{"$f":"D28/F6","v":{"$error":"#DIV/0!"}},{"$f":"E28/F6","v":{"$error":"#DIV/0!"}},{"$f":"F28/F6","v":{"$error":"#DIV/0!"}}]
[null,"Total annual energy consumption",{"$f":"C19*C27*F6/1000","v":0},{"$f":"'Supporting sheet'!I13*D19","v":0},{"$f":"'Supporting sheet'!I14*E19","v":0},{"$f":"'Supporting sheet'!I15*F19","v":0}]
[null,"Total annual cost",{"$f":"(C30*F7)+(((C20*C19)+C21)/C29)","v":{"$error":"#DIV/0!"}},{"$f":"'Supporting sheet'!K13*D19","v":0},{"$f":"'Supporting sheet'!K14*E19","v":0},{"$f":"'Supporting sheet'!K15*F19","v":0}]
[null,"Total annual CO2 emission",{"$f":"C30*F8/1000","v":0},{"$f":"'Supporting sheet'!M13/1000*D19","v":0},{"$f":"'Supporting sheet'!M14/1000*E19","v":0},{"$f":"'Supporting sheet'!M15/1000*F19","v":0}]
[]
[null,"Results"]
[null,{"$f":"B40","v":"Opportunities"},null,"Annual cost savings","Payback period"]
[null,{"$f":"B41","v":"Option A"},null,{"$f":"C31-D31","v":{"$error":"#DIV/0!"}},{"$f":"'Supporting sheet'!L19","v":{"$error":"#DIV/0!"}}]
[null,{"$f":"B42","v":"Option B"},null,{"$f":"C31-E31","v":{"$error":"#DIV/0!"}},{"$f":"'Supporting sheet'!L20","v":{"$error":"#DIV/0!"}}]
[null,{"$f":"B43","v":"Option C"},null,{"$f":"C31-F31","v":{"$error":"#DIV/0!"}},{"$f":"'Supporting sheet'!L21","v":{"$error":"#DIV/0!"}}]
[]
[null,"Opportunities",null,"Annual electricity savings","Annual CO2 savings","Annual waste savings"]
[null,{"$f":"D17","v":"Option A"},null,{"$f":"C30-D30","v":0},{"$f":"C32-D32","v":0},{"$f":"C19*(F6/C28)","v":{"$error":"#DIV/0!"}}]
[null,{"$f":"E17","v":"Option B"},null,{"$f":"C30-E30","v":0},{"$f":"C32-E32","v":0},{"$f":"C19*(F6/C28)","v":{"$error":"#DIV/0!"}}]
[null,{"$f":"F17","v":"Option C"},null,{"$f":"C30-F30","v":0},{"$f":"C32-F32","v":0},{"$f":"C19*(F6/C28)","v":{"$error":"#DIV/0!"}}]

{"sheet":"PIM export","index":1,"n_rows":1324,"n_cols":12,"rows_kept":1324,"cut":false,"hidden":true,"merged":[]}
["Code","Short description (product)","Equivalent to","Max. system power","Lamp power","Rated luminous flux according to IEC 62722-2-1","Lifetime (L70)","Dimmability","Smart?"]
["Paste/type product code",null,null,null,null,null,null,null,{"$f":"IF(OR(H2=$L$5,H2=$L$6,H2=$L$9),\"Smart\",\"\")","v":""}]
[" ",null,null,null,null,null,null,null,"",null,null,"Dimmability options"]
[140043898,"LED E T5 batten 600 9W 3000K CT","TL 1x18W",9,null,900,40000,"On-Off","",null,null,"1-10V"]
[140043899,"LED E T5 batten 600 9W 4000K CT","TL 1x18W",9,null,950,40000,"On-Off","",null,null,"BLE"]
[140043900,"LED E T5 batten 1200 18W 3000K CT","TL 1x36W",18,null,1850,40000,"On-Off","",null,null,"BLE2"]
[140043901,"LED E T5 batten 1200 18W 4000K CT","TL 1x36W",18,null,1950,40000,"On-Off","",null,null,"DALI"]
[140043902,"LED E T5 batten 900 11W S 3000K BL","TL 1x18W",11,null,1100,40000,"On-Off","",null,null,"DALI2"]
[140043903,"LED E T5 batten 600 9W S 3000K BL","TL 1x18W",9,null,900,40000,"On-Off","",null,null,"DALI2+BLE2"]
[140043904,"LED E T5 batten 300 4.5W S 3000K BL","TL 1x9W",4.5,null,450,40000,"On-Off","",null,null,"On-Off"]
[140043968,"LEDPanelRc-G Sq598-33W-4000-WH-CT","TL 4x18W",33,null,4300,70000,"On-Off","",null,null,"Sensor controlled (MD)"]
[140043971,"LEDPanelRc-G Re298-33W-3000-WH-CT","TL 2x36W",33,null,4200,70000,"On-Off","",null,null,"STEP"]
[140044075,"LED E T5 batten 900 11W S 4000K BL","TL 1x18W",11,null,1200,40000,"On-Off","",null,null,"Triac"]
[140044076,"LED E T5 batten 600 9W S 4000K BL","TL 1x18W",9,null,950,40000,"On-Off",""]
[140044077,"LED E T5 batten 300 4.5W S 4000K BL","TL 1x9W",4.5,null,500,40000,"On-Off",""]
[140044080,"LEDSpotRA-HQ 7W-Dim-3000-40D-AL-CT","Halogen 35W",7,null,420,50000,"Triac",""]
[140044084,"LEDSpotRA-HQ 7W-Dim-4000-40D-AL-CT","Halogen 35W",7,null,450,50000,"Triac",""]
[140044100,"LEDSpotRA-HQ 7W-Dim-4000-40D-WH-CT","Halogen 35W",7,null,450,50000,"Triac",""]
[140044292,"LED E T5 batten 1200 13W S 4000K BL","TL 1x30W",13,null,1400,40000,"On-Off",""]
[140044293,"LED E T5 batten 1200 13W S 3000K BL","TL 1x30W",13,null,1300,40000,"On-Off",""]
[140046181,"LEDPanelRc-G Sq598-33W-DALI-3000-WH-CT","TL 4x18W",33,null,4200,70000,"DALI",""]
[140046182,"LEDPanelRc-G Sq598-33W-DALI-4000-WH-CT","TL 4x18W",33,null,4300,70000,"DALI",""]
[140046185,"LEDPanelRc-G Re298-33W-DALI-3000-WH-CT","TL 2x36W",33,null,4200,70000,"DALI",""]
[140046186,"LEDPanelRc-G Re298-33W-DALI-4000-WH-CT","TL 2x36W",33,null,4300,70000,"DALI",""]
[140046187,"LEDPanelRc-G Re166-21W-DALI-3000-WH-CT","TL 1x36W",21,null,2000,70000,"DALI",""]
[140046188,"LEDPanelRc-G Re166-21W-DALI-4000-WH-CT","TL 1x36W",21,null,2090,70000,"DALI",""]
[140051474,"LEDDownlightRc-HZ R125-7W-Dim-3000-WH","CFL 1x13W",7,null,600,50000,"Triac",""]
[140051477,"LEDDownlightRc-HZ R150-10W-Dim-4000-WH","CFL 1x18W",10,null,900,50000,"Triac",""]
[140051479,"LEDDownlightRc-HZ R175-13W-Dim-4000-WH","CFL 1x26W",13,null,1200,50000,"Triac",""]
[140051481,"LEDDownlightRc-HZ R200-16W-Dim-4000-WH","CFL 1x26W",16,null,1500,50000,"Triac",""]
[140054053,"LEDPanelSp-Z L1222-75W-DALI-3000-AL","TL 2x58W",75,null,7875,60000,"DALI2",""]
[140054054,"LEDPanelSp-Z L1222-75W-DALI-4000-AL","TL 2x58W",75,null,7875,60000,"DALI2",""]
[140054076,"LEDSpotRF-E 4.5W-2700-36D-AL-CT","Halogen 35W",4.5,null,330,30000,"On-Off",""]
[140054077,"LEDSpotRF-E 4.5W-4000-36D-AL-CT","Halogen 35W",4.5,null,350,30000,"On-Off",""]
[140054439,"LEDSpot3C-P 30W-3000-40D-WH","HID 50W",30,null,2400,50000,"On-Off",""]
[140054443,"LEDSpot3C-P 30W-3000-40D-BL","HID 50W",30,null,2400,50000,"On-Off",""]
[140054447,"LEDSpot3C-P 30W-4000-40D-WH","HID 50W",30,null,2550,50000,"On-Off",""]
[140054451,"LEDSpot3C-P 30W-4000-40D-BL","HID 50W",30,null,2550,50000,"On-Off",""]
[140054455,"LEDSpotRA-P 30W-3000-40D-WH","HID 35W",30,null,2400,50000,"On-Off",""]
[140054459,"LEDSpotRA-P 30W-4000-40D-WH","HID 35W",30,null,2550,50000,"On-Off",""]
[140055458,"LEDSpotRF-E 7W-4000-36D-AL","Halogen 50W",7,null,530,30000,"On-Off",""]
[140056557,"LEDDownlightRc-Sl-E Rd150-12W-3000-WH","CFL 1x18W",12,null,1020,40000,"On-Off",""]
[140056558,"LEDDownlightRc-Sl-E Rd150-12W-4000-WH","CFL 1x18W",12,null,1020,40000,"On-Off",""]
[140056559,"LEDDownlightRc-Sl-E Rd200-24W-3000-WH","CFL 2x26W",24,null,2040,40000,"On-Off",""]
[140056560,"LEDDownlightRc-Sl-E Rd200-24W-4000-WH","CFL 2x26W",24,null,2040,40000,"On-Off",""]
[140056561,"LEDDownlightRc-Sl-E Sq150-12W-3000-WH","CFL 1x18W",12,null,1020,40000,"On-Off",""]
[140056563,"LEDDownlightRc-Sl-E Sq200-24W-3000-WH","CFL 2x26W",24,null,2040,40000,"On-Off",""]
[140056564,"LEDDownlightRc-Sl-E Sq200-24W-4000-WH","CFL 2x26W",24,null,2040,40000,"On-Off",""]
[140057152,"LEDDownlightRc-P-HG R200-15W-3000","CFL 1x26W",15,null,1620,70000,"On-Off",""]
[140057153,"LEDDownlightRc-P-HG R200-15W-4000","CFL 1x26W",15,null,1650,70000,"On-Off",""]
[140057154,"LEDDownlightRc-P-HG R150-11.5W-3000","CFL 1x18W",11.5,null,1240,70000,"On-Off",""]
[140057155,"LEDDownlightRc-P-HG R150-11.5W-4000","CFL 1x18W",11.5,null,1265,70000,"On-Off",""]
[140057156,"LEDDownlightRc-P-HG R200-23W-3000","CFL 2x26W",23,null,2480,70000,"On-Off",""]
[140057157,"LEDDownlightRc-P-HG R200-23W-4000","CFL 2x26W",23,null,2530,70000,"On-Off",""]
[140057158,"LEDDownlightRc-P-HG R200-33W-3000","CFL 2x32W",33,null,3560,70000,"On-Off",""]
[140057159,"LEDDownlightRc-P-HG R200-33W-4000","CFL 2x32W",33,null,3630,70000,"On-Off",""]
[140057160,"LEDDownlightRc-P-HG R200-15W-DALI-3000","CFL 1x26W",15,null,1620,70000,"DALI",""]
[140057161,"LEDDownlightRc-P-HG R200-15W-DALI-4000","CFL 1x26W",15,null,1650,70000,"DALI",""]
[140057162,"LEDDownlightRc-P-HG R150-11.5W-DALI-3000","CFL 1x18W",11.5,null,1240,70000,"DALI",""]
[140057163,"LEDDownlightRc-P-HG R150-11.5W-DALI-4000","CFL 1x18W",11.5,null,1265,70000,"DALI",""]
[140057164,"LEDDownlightRc-P-HG R200-23W-DALI-3000","CFL 2x26W",23,null,2480,70000,"DALI",""]
[140057165,"LEDDownlightRc-P-HG R200-23W-DALI-4000","CFL 2x26W",23,null,2530,70000,"DALI",""]
[140057166,"LEDDownlightRc-P-HG R200-33W-DALI-3000","CFL 2x32W",33,null,3560,70000,"DALI",""]
[140057167,"LEDDownlightRc-P-HG R200-33W-DALI-4000","CFL 2x32W",33,null,3630,70000,"DALI",""]
[140057168,"LEDDownlightRc-P-MW R200-15W-3000","CFL 1x26W",15,null,1620,70000,"On-Off",""]
[140057169,"LEDDownlightRc-P-MW R200-15W-4000","CFL 1x26W",15,null,1650,70000,"On-Off",{"$f":"IF(OR(H66=$L$5,H66=$L$6,H66=$L$9),\"Smart\",\"\")","v":""}]
[140057170,"LEDDownlightRc-P-MW R150-11.5W-3000","CFL 1x18W",11.5,null,1240,70000,"On-Off",""]
[140057171,"LEDDownlightRc-P-MW R150-11.5W-4000","CFL 1x18W",11.5,null,1265,70000,"On-Off",""]
[140057172,"LEDDownlightRc-P-MW R200-23W-3000","CFL 2x26W",23,null,2480,70000,"On-Off",""]
[140057173,"LEDDownlightRc-P-MW R200-23W-4000","CFL 2x26W",23,null,2530,70000,"On-Off",""]
[140057174,"LEDDownlightRc-P-MW R200-33W-3000","CFL 2x32W",33,null,3560,70000,"On-Off",""]
[140057175,"LEDDownlightRc-P-MW R200-33W-4000","CFL 2x32W",33,null,3630,70000,"On-Off",""]
[140057176,"LEDDownlightRc-P-MW R200-15W-DALI-3000","CFL 1x26W",15,null,1620,70000,"DALI",""]
[140057177,"LEDDownlightRc-P-MW R200-15W-DALI-4000","CFL 1x26W",15,null,1650,70000,"DALI",""]
[140057178,"LEDDownlightRc-P-MW R150-11.5W-DALI-3000","CFL 1x18W",11.5,null,1240,70000,"DALI",""]
[140057179,"LEDDownlightRc-P-MW R150-11.5W-DALI-4000","CFL 1x18W",11.5,null,1265,70000,"DALI",""]
[140057180,"LEDDownlightRc-P-MW R200-23W-DALI-3000","CFL 2x26W",23,null,2480,70000,"DALI",""]
[140057181,"LEDDownlightRc-P-MW R200-23W-DALI-4000","CFL 2x26W",23,null,2530,70000,"DALI",""]
[140057182,"LEDDownlightRc-P-MW R200-33W-DALI-3000","CFL 2x32W",33,null,3560,70000,"DALI",""]
[140057183,"LEDDownlightRc-P-MW R200-33W-DALI-4000","CFL 2x32W",33,null,3630,70000,"DALI",""]
[140058488,"LEDSpotRA-P 45W-3000-36D-WH","HID 50W",45,null,3375,50000,"On-Off",""]
[140058492,"LEDSpotRA-P 45W-4000-36D-WH","HID 50W",45,null,3600,50000,"On-Off",""]
[140060948,"LED-E-GU10-3,5W-3000K-36D-DIM","Halogen 35W",null,3.5,245,15000,"Triac",""]
[140060949,"LED-E-GU10-5,2W-3000K-36D-DIM","Halogen 50W",null,5.2,350,15000,"Triac",""]
[140060951,"LED-E-GU10-7,5W-3000K-36D-DIM","Halogen 75W",null,7.5,565,15000,"Triac",""]
[140060952,"LED-E-GU10-3,5W-4000K-36D-DIM","Halogen 35W",null,3.5,260,15000,"Triac",""]
[140060953,"LED-E-GU10-5,2W-4000K-36D-DIM","Halogen 50W",null,5.2,360,15000,"Triac",""]
[140060955,"LED-E-GU10-7,5W-4000K-36D-DIM","Halogen 75W",null,7.5,575,15000,"Triac",""]
[140061278,"LEDSpotRA HQ2 8W-Dim-2700-40D-AL-IP44","Halogen 50W",8,null,640,50000,"Triac",""]
[140061279,"LEDSpotRA HQ2 8W-Dim-3000-40D-AL-IP44","Halogen 50W",8,null,640,50000,"Triac",""]
[140061280,"LEDSpotRA HQ2 8W-Dim-4000-40D-AL-IP44","Halogen 50W",8,null,680,50000,"Triac",""]
[140061281,"LEDSpotRA HQ2 8W-Dim-2700-40D-WH-IP44","Halogen 50W",8,null,640,50000,"Triac",""]
[140061282,"LEDSpotRA HQ2 8W-Dim-3000-40D-WH-IP44","Halogen 50W",8,null,640,50000,"Triac",""]
[140061283,"LEDSpotRA HQ2 8W-Dim-4000-40D-WH-IP44","Halogen 50W",8,null,680,50000,"Triac",""]
[140062030,"LEDFlood-P Re440-90W-4000-W-BL","HID 250W",90,null,11250,70000,"On-Off",""]
[140062031,"LEDFlood-P Re440-90W-4000-AS-BL","HID 250W",90,null,11250,70000,"On-Off",""]
[140062032,"LEDFlood-P Re440-125W-4000-W-BL","HID 400W",125,null,15625,70000,"On-Off",""]
[140062033,"LEDFlood-P Re440-125W-4000-AS-BL","HID 400W",125,null,15625,70000,"On-Off",""]
[140062034,"LEDFlood-P Re440-160W-4000-W-BL","HID 400W",160,null,20000,70000,"On-Off",""]
[140062035,"LEDFlood-P Re440-160W-4000-AS-BL","HID 400W",160,null,20000,70000,"On-Off",""]
[140062610,"LED P T8 glass 600 8W 100pct 3000K CT","TL 1x18W",null,8,1050,50000,"On-Off",""]
[140062611,"LED P T8 glass 600 8W 100pct 4000K CT","TL 1x18W",null,8,1050,50000,"On-Off",""]
[140062612,"LED P T8 glass 600 8W 100pct 6500K CT","TL 1x18W",null,8,1050,50000,"On-Off",""]
[140062613,"LED P T8 glass 1200 16W 100pct 3000K CT","TL 1x36W",null,16,2100,50000,"On-Off",""]
[140062614,"LED P T8 glass 1200 16W 100pct 4000K CT","TL 1x36W",null,16,2100,50000,"On-Off",""]
[140062615,"LED P T8 glass 1200 16W 100pct 6500K CT","TL 1x36W",null,16,2100,50000,"On-Off",""]
[140062616,"LED P T8 glass 1500 23W 100pct 3000K CT","TL 1x58W",null,23,3100,50000,"On-Off",""]
[140062617,"LED P T8 glass 1500 23W 100pct 4000K CT","TL 1x58W",null,23,3100,50000,"On-Off",""]
[140062618,"LED P T8 glass 1500 23W 100pct 6500K CT","TL 1x58W",null,23,3100,50000,"On-Off",""]
[140062700,"LEDPanelRc-S-E2 Sq595-34W-3000-WH-U22","TL 4x18W",34,null,3700,50000,"On-Off",""]
[140062701,"LEDPanelRc-S-E2 Sq595-34W-4000-WH-U22","TL 4x18W",34,null,3900,50000,"On-Off",""]
[140062703,"LEDPanelRc-S-E2 Sq622-34W-3000-WH-U22","TL 4x18W",34,null,3700,50000,"On-Off",""]
[140062704,"LEDPanelRc-S-E2 Sq622-34W-4000-WH-U22","TL 4x18W",34,null,3900,50000,"On-Off",""]
[140062706,"LEDPanelRc-S-E2 Re295-34W-3000-WH-U22","TL 2x36W",34,null,3700,50000,"On-Off",""]
[140062707,"LEDPanelRc-S-E2 Re295-34W-4000-WH-U22","TL 2x36W",34,null,3900,50000,"On-Off",""]
[140062783,"LED P T5 batten 600 9W DIM 4000K CT","TL 1x18W",9,null,1000,40000,"Triac",""]
[140062784,"LED P T5 batten 600 9W DIM 3000K CT","TL 1x18W",9,null,1100,40000,"Triac",""]
[140062785,"LED P T5 batten 1200 18W DIM 4000K CT","TL 1x36W",18,null,2100,40000,"Triac",""]
[140062786,"LED P T5 batten 1200 18W DIM 3000K CT","TL 1x36W",18,null,2300,40000,"Triac",""]
[140063304,"LED T8 Batten 1200mm 38W 3000K CT","TL 2x36W",38,null,3800,30000,"On-Off",""]
[140063305,"LED T8 Batten 1200mm 38W 4000K CT","TL 2x36W",38,null,4000,30000,"On-Off",""]
[140063306,"LED T8 Batten 1200mm 38W 6500K CT","TL 2x36W",38,null,4000,30000,"On-Off",""]
[140063611,"LEDDownlightRc-P-HG R150-11.5W-BLE-3000","CFL 1x18W",11.5,null,1240,70000,"BLE","Smart"]
[140063612,"LEDDownlightRc-P-HG R150-11.5W-BLE-4000","CFL 1x18W",11.5,null,1265,70000,"BLE","Smart"]
[140063613,"LEDDownlightRc-P-HG R200-15W-BLE-3000","CFL 1x26W",15,null,1620,70000,"BLE","Smart"]
[140063614,"LEDDownlightRc-P-HG R200-15W-BLE-4000","CFL 1x26W",15,null,1650,70000,"BLE","Smart"]
[140063615,"LEDDownlightRc-P-HG R200-23W-BLE-3000","CFL 2x26W",23,null,2480,70000,"BLE","Smart"]
[140063616,"LEDDownlightRc-P-HG R200-23W-BLE-4000","CFL 2x26W",23,null,2530,70000,"BLE","Smart"]
[140063617,"LEDDownlightRc-P-HG R200-33W-BLE-3000","CFL 2x32W",33,null,3560,70000,"BLE","Smart"]
[140063618,"LEDDownlightRc-P-HG R200-33W-BLE-4000","CFL 2x32W",33,null,3630,70000,"BLE",{"$f":"IF(OR(H130=$L$5,H130=$L$6,H130=$L$9),\"Smart\",\"\")","v":"Smart"}]
[140063619,"LEDDownlightRc-P-MW R150-11.5W-BLE-3000","CFL 1x18W",11.5,null,1240,70000,"BLE","Smart"]
[140063620,"LEDDownlightRc-P-MW R150-11.5W-BLE-4000","CFL 1x18W",11.5,null,1265,70000,"BLE","Smart"]
[140063621,"LEDDownlightRc-P-MW R200-15W-BLE-3000","CFL 1x26W",15,null,1620,70000,"BLE","Smart"]
[140063622,"LEDDownlightRc-P-MW R200-15W-BLE-4000","CFL 1x26W",15,null,1650,70000,"BLE","Smart"]
[140063623,"LEDDownlightRc-P-MW R200-23W-BLE-3000","CFL 2x26W",23,null,2480,70000,"BLE","Smart"]
[140063624,"LEDDownlightRc-P-MW R200-23W-BLE-4000","CFL 2x26W",23,null,2530,70000,"BLE","Smart"]
[140063625,"LEDDownlightRc-P-MW R200-33W-BLE-3000","CFL 2x32W",33,null,3560,70000,"BLE","Smart"]
[140063626,"LEDDownlightRc-P-MW R200-33W-BLE-4000","CFL 2x32W",33,null,3630,70000,"BLE","Smart"]
[140064477,"LEDPorch-E Re120-5W-3000K-WH","TL 8W",5,null,450,50000,"On-Off",""]
[140064478,"LEDPorch-E Re120-5W-4000K-WH","TL 8W",5,null,500,50000,"On-Off",""]
[140064479,"LEDPorch-E Re120-6W-3000K-MD-WH","TL 8W",6,null,480,50000,"Sensor controlled (MD)",""]
[140064480,"LEDPorch-E Re120-6W-4000K-MD-WH","TL 8W",6,null,510,50000,"Sensor controlled (MD)",""]
[140066204,"LED E C module 22W DIM 2700K Clio CT","CFL TC-DD/PL-Q 28W",null,22,2300,30000,"Triac",""]
[140066205,"LED E C module 22W DIM 4000K Clio CT","CFL TC-DD/PL-Q 28W",null,22,2400,30000,"Triac",""]
[140066206,"LED E C module 36W DIM 2700K Clio CT","CFL TC-DD/PL-Q 38W",null,36,3800,30000,"Triac",""]
[140066207,"LED E C module 36W DIM 4000K Clio CT","CFL TC-DD/PL-Q 38W",null,36,3900,30000,"Triac",""]
[140066385,"LEDStreetlight 40W-4000K-SE","HID 70W",40,null,4600,70000,"On-Off",""]
[140066573,"LED E C module 12W 2700K Clio CT","GLS 75W",null,12,1300,30000,"On-Off",""]
[140066574,"LED E C module 12W 4000K Clio CT","GLS 75W",null,12,1400,30000,"On-Off",""]
[140066575,"LED E C module 16W 2700K Clio CT II","GLS 100W",null,16,1650,30000,"On-Off",""]
[140066576,"LED E C module 16W 4000K Clio CT II","GLS 100W",null,16,1800,30000,"On-Off",""]
[500010000400,"LED-E-A60-FILA-E27-7W-DIM-4000K-FR","GLS 60W",null,7,806,15000,"Triac",""]
[500010000500,"LED-E-P45-FILA-E14-2.8W-DIM-2700K-FR","GLS 25W",null,2.8,250,15000,"Triac",""]
[500010000600,"LED-E-P45-FILA-E14-2.8W-2700K-CL","GLS 25W",null,2.8,250,15000,"On-Off",""]
[500010000700,"LED-E-P45-FILA-E14-4.5W-DIM-2700K-FR","GLS 40W",null,4.5,470,15000,"Triac",""]
[500010000800,"LED-E-G45-FILA-E27-2.8W-DIM-2700K-FR","GLS 25W",null,2.8,250,15000,"Triac",""]
[500010000900,"LED-E-G45-FILA-E27-4.5W-DIM-2700K-CL","GLS 40W",null,4.5,470,15000,"Triac",""]
[500010001000,"LED-E-A60-FILA-E27-7W-DIM-2700K-CL","GLS 60W",null,7,806,15000,"Triac",""]
[500010001100,"LED-E-A60-FILA-E27-4.5W-DIM-2700K-CL","GLS 40W",null,4.5,470,15000,"Triac",""]
[500010001200,"LED-E-A60-FILA-E27-7W-DIM-2700K-FR","GLS 60W",null,7,806,15000,"Triac",""]
[500010001300,"LED-E-A60-FILA-E27-4.5W-DIM-4000K-FR","GLS 40W",null,4.5,470,15000,"Triac",""]
[500010001400,"LED-E-A60-FILA-E27-4W-2700K-CL","GLS 40W",null,4,470,15000,"On-Off",""]
[500010001500,"LED-E-A60-FILA-E27-7W-2700K-CL","GLS 60W",null,7,806,15000,"On-Off",""]
[500010001600,"LED-E-G45-FILA-E27-4.5W-DIM-2700K-FR","GLS 40W",null,4.5,470,15000,"Triac",""]
[500010001700,"LED-E-P45-FILA-E14-4.5W-DIM-2700K-CL","GLS 40W",null,4.5,470,15000,"Triac",""]
[500010001800,"LED-E-P45-FILA-E14-4W-2700K-CL","GLS 40W",null,4,470,15000,"On-Off",""]
[500010001900,"LED-E-A60-FILA-E27-4.5W-DIM-2700K-FR","GLS 40W",null,4.5,470,15000,"Triac",""]
[500010002000,"LED-E-G45-FILA-E27-2.8W-2700K-CL","GLS 25W",null,2.8,250,15000,"On-Off",""]
[500011000100,"LED-E-B35-FILA-E14-4.5W-DIM-2700K-FR","GLS 40W",null,4.5,470,15000,"Triac",""]
[500011000200,"LED-E-B35-FILA-E14-4.5W-DIM-2700K-CL","GLS 40W",null,4.5,470,15000,"Triac",""]
[500011000300,"LED-E-B35-FILA-E14-4W-2700K-CL","GLS 40W",null,4,470,15000,"On-Off",""]
[500011000400,"LED-E-B35-FILA-E14-2.8W-DIM-2700K-FR","GLS 25W",null,2.8,250,15000,"Triac",""]
[500011000500,"LED-E-B35-FILA-E14-2.8W-2700K-CL","GLS 25W",null,2.8,250,15000,"On-Off",""]
[500012000100,"LED-E-ST64-FILA-E27-7W-DIM-2700K-CL","GLS 60W",null,7,806,15000,"Triac",""]
[500012000200,"LED-E-ST64-FILA-E27-4.5W-DIM-2200K-CL","GLS 40W",null,4.5,400,15000,"Triac",""]
[500012000300,"LED-E-ST64-FILA-E27-4.5W-DIM-2700K-CL","GLS 40W",null,4.5,470,15000,"Triac",""]
[500012000400,"LED-E-ST64-FILA-E27-7W-DIM-2200K-CL","GLS 60W",null,7,700,15000,"Triac",""]
[520020000100,"LED HC300 12W 2700K Apollo III","GLS 75W",12,null,1150,30000,"On-Off",""]
[520020000200,"LED HC300 12W 4000K Apollo III","GLS 75W",12,null,1250,30000,"On-Off",""]
[520021000300,"LED HC350 16W 2700K IP44 Apollo III","GLS 100W",16,null,1450,30000,"On-Off",""]
[520021000400,"LED HC350 16W 4000K IP44 Apollo III","GLS 100W",16,null,1580,30000,"On-Off",""]
[520021000700,"LED HC350 22W DIM 2700K IP44 Apollo","GLS 100W",22,null,1955,30000,"Triac",""]
[520021000800,"LED HC350 22W DIM 4000K IP44 Apollo","GLS 100W",22,null,2040,30000,"Triac",""]
[520021004400,"LED HC350 17W 2700K Apollo B","GLS 100W",17,null,1500,30000,"On-Off",""]
[520021004500,"LED HC350 17W 4000K Apollo B","GLS 100W",17,null,1600,30000,"On-Off",""]
[520021004600,"LED HC350 23W 2700K Apollo B","GLS 100W",23,null,2100,30000,"On-Off",""]
[520021004700,"LED HC350 23W 4000K Apollo B","GLS 100W",23,null,2200,30000,"On-Off",""]
[520028005600,"LED HC260 11W 2700K Apollo B","GLS 75W",11,null,950,30000,"On-Off",""]
[520028005700,"LED HC260 11W 4000K Apollo B","GLS 75W",11,null,1050,30000,"On-Off",""]
[522020001100,"LEDWall-Mounted-E2 Rd275-22W-MD-EM3","CFL 2x26W",22,null,2500,50000,"Sensor controlled (MD)",""]
[522020001200,"LEDWall-Mounted-E2 Rd275-22W-EM3","CFL 2x26W",22,null,2500,50000,"On-Off",""]
[522020001300,"LEDWall-Mounted-E2 Rd275-14W-MD-EM3","CFL 2x18W",14,null,1700,50000,"Sensor controlled (MD)",""]
[522020001400,"LEDWall-Mounted-E2 Rd275-14W-EM3","CFL 2x18W",14,null,1700,50000,"On-Off",""]
[522020001500,"LEDWall-Mounted-E2 Rd275-22W-MD","CFL 2x26W",22,null,2500,50000,"Sensor controlled (MD)",{"$f":"IF(OR(H194=$L$5,H194=$L$6,H194=$L$9),\"Smart\",\"\")","v":""}]
[522020001600,"LEDWall-Mounted-E2 Rd275-22W","CFL 2x26W",22,null,2500,50000,"On-Off",""]
[522020001700,"LEDWall-Mounted-E2 Rd275-14W-MD","CFL 2x18W",14,null,1700,50000,"Sensor controlled (MD)",""]
[522020001800,"LEDWall-Mounted-E2 Rd275-14W","CFL 2x18W",14,null,1700,50000,"On-Off",""]
[529001001000,"LEDLinear-E CL06-20W-3000-WH","TL 2x18W",20,null,2100,70000,"On-Off",""]
[529001001100,"LEDLinear-E CL06-20W-4000-WH","TL 2x18W",20,null,2300,70000,"On-Off",""]
[531000003000,"LEDWaterproof-CLA-E L650-20W-4000","TL 2x18W",20,null,2500,50000,"On-Off",""]
[531000003600,"LEDWaterproof-CLA-E L1550-53W-4000-MD","TL 2x58W",53,null,6625,50000,"On-Off",""]
[531000003700,"LEDWaterproof-CLA-E L1550-29W-4000-MD","TL 1x58W",29,null,3625,50000,"On-Off",""]
[531000003800,"LEDWaterproof-CLA-E L1250-43W-4000-MD","TL 2x36W",43,null,5375,50000,"On-Off",""]
[531000003900,"LEDWaterproof-CLA-E L1250-20W-4000-MD","TL 1x36W",20,null,2500,50000,"On-Off",""]
[531000004100,"LEDWaterproof-CLA-E L1250-20W-4000","TL 1x36W",20,null,2500,50000,"On-Off",""]
[531000004200,"LEDWaterproof-CLA-E L1250-43W-4000","TL 2x36W",43,null,5375,50000,"On-Off",""]
[531000004300,"LEDWaterproof-CLA-E L1550-29W-4000","TL 1x58W",29,null,3625,50000,"On-Off",""]
[531000004400,"LEDWaterproof-CLA-E L1550-53W-4000","TL 2x58W",53,null,6625,50000,"On-Off",""]
[534001000100,"LEDTrunking Mod L15-35W-4000-DF-DALI-DZ","TL 2x58W",35,null,5250,70000,"DALI2",""]
[540001023800,"LEDDownlightRc-B Rd150-12W-3000-WH","CFL 1x18W",12,null,930,30000,"On-Off",""]
[540001031800,"LEDDownlightRc-P-MW R200-44W-4000","HID 70W",44,null,5500,70000,"On-Off",""]
[540001045300,"LEDDLRc-P-HG R150-11.5W-3000-WL","CFL 1x18W",11.5,null,1240,70000,"On-Off",""]
[540001045400,"LEDDLRc-P-HG R150-11.5W-4000-WL","CFL 1x18W",11.5,null,1265,70000,"On-Off",""]
[540001045500,"LEDDLRc-P-HG R200-15W-3000-WL","CFL 1x26W",15,null,1620,70000,"On-Off",""]
[540001045600,"LEDDLRc-P-HG R200-15W-4000-WL","CFL 1x26W",15,null,1650,70000,"On-Off",""]
[540001045700,"LEDDLRc-P-HG R200-23W-3000-WL","CFL 2x26W",23,null,2480,70000,"On-Off",""]
[540001045800,"LEDDLRc-P-HG R200-23W-4000-WL","CFL 2x26W",23,null,2530,70000,"On-Off",""]
[540001045900,"LEDDLRc-P-HG R200-33W-3000-WL","CFL 2x32W",33,null,3560,70000,"On-Off",""]
[540001046000,"LEDDLRc-P-HG R200-33W-4000-WL","CFL 2x32W",33,null,3630,70000,"On-Off",""]
[540001046100,"LEDDLRc-P-HG R150-11.5W-DALI-3000-WL","CFL 1x18W",11.5,null,1240,70000,"DALI",""]
[540001046200,"LEDDLRc-P-HG R150-11.5W-DALI-4000-WL","CFL 1x18W",11.5,null,1265,70000,"DALI",""]
[540001046300,"LEDDLRc-P-HG R200-15W-DALI-3000-WL","CFL 1x26W",15,null,1620,70000,"DALI",""]
[540001046400,"LEDDLRc-P-HG R200-15W-DALI-4000-WL","CFL 1x26W",15,null,1650,70000,"DALI",""]
[540001046500,"LEDDLRc-P-HG R200-23W-DALI-3000-WL","CFL 2x26W",23,null,2480,70000,"DALI",""]
[540001046600,"LEDDLRc-P-HG R200-23W-DALI-4000-WL","CFL 2x26W",23,null,2530,70000,"DALI",""]
[540001046700,"LEDDLRc-P-HG R200-33W-DALI-3000-WL","CFL 2x32W",33,null,3560,70000,"DALI",""]
[540001046800,"LEDDLRc-P-HG R200-33W-DALI-4000-WL","CFL 2x32W",33,null,3630,70000,"DALI",""]
[540001046900,"LEDDLRc-P-HG R150-11.5W-BLE-3000-WL","CFL 1x18W",11.5,null,1240,70000,"BLE","Smart"]
[540001047000,"LEDDLRc-P-HG R150-11.5W-BLE-4000-WL","CFL 1x18W",11.5,null,1265,70000,"BLE","Smart"]
[540001047100,"LEDDLRc-P-HG R200-15W-BLE-3000-WL","CFL 1x26W",15,null,1620,70000,"BLE","Smart"]
[540001047200,"LEDDLRc-P-HG R200-15W-BLE-4000-WL","CFL 1x26W",15,null,1650,70000,"BLE","Smart"]
[540001047300,"LEDDLRc-P-HG R200-23W-BLE-3000-WL","CFL 2x26W",23,null,2480,70000,"BLE","Smart"]
[540001047400,"LEDDLRc-P-HG R200-23W-BLE-4000-WL","CFL 2x26W",23,null,2530,70000,"BLE","Smart"]
[540001047500,"LEDDLRc-P-HG R200-33W-BLE-3000-WL","CFL 2x32W",33,null,3560,70000,"BLE","Smart"]
[540001047600,"LEDDLRc-P-HG R200-33W-BLE-4000-WL","CFL 2x32W",33,null,3630,70000,"BLE","Smart"]
[540001047700,"LEDDLRc-P-MW R150-11.5W-3000-WL","CFL 1x18W",11.5,null,1240,70000,"On-Off",""]
[540001047800,"LEDDLRc-P-MW R150-11.5W-4000-WL","CFL 1x18W",11.5,null,1265,70000,"On-Off",""]
[540001047900,"LEDDLRc-P-MW R200-15W-3000-WL","CFL 1x26W",15,null,1620,70000,"On-Off",""]
[540001048000,"LEDDLRc-P-MW R200-15W-4000-WL","CFL 1x26W",15,null,1650,70000,"On-Off",""]
[540001048100,"LEDDLRc-P-MW R200-23W-3000-WL","CFL 2x26W",23,null,2480,70000,"On-Off",""]
[540001048200,"LEDDLRc-P-MW R200-23W-4000-WL","CFL 2x26W",23,null,2530,70000,"On-Off",""]
[540001048300,"LEDDLRc-P-MW R200-33W-3000-WL","CFL 2x32W",33,null,3560,70000,"On-Off",""]
[540001048400,"LEDDLRc-P-MW R200-33W-4000-WL","CFL 2x32W",33,null,3630,70000,"On-Off",""]
[540001048500,"LEDDLRc-P-MW R150-11.5W-DALI-3000-WL","CFL 1x18W",11.5,null,1240,70000,"DALI",""]
[540001048600,"LEDDLRc-P-MW R150-11.5W-DALI-4000-WL","CFL 1x18W",11.5,null,1265,70000,"DALI",""]
[540001048700,"LEDDLRc-P-MW R200-15W-DALI-3000-WL","CFL 1x26W",15,null,1620,70000,"DALI",""]
[540001048800,"LEDDLRc-P-MW R200-15W-DALI-4000-WL","CFL 1x26W",15,null,1650,70000,"DALI",""]
[540001048900,"LEDDLRc-P-MW R200-23W-DALI-3000-WL","CFL 2x26W",23,null,2480,70000,"DALI",""]
[540001049000,"LEDDLRc-P-MW R200-23W-DALI-4000-WL","CFL 2x26W",23,null,2530,70000,"DALI",""]
[540001049100,"LEDDLRc-P-MW R200-33W-DALI-3000-WL","CFL 2x32W",33,null,3560,70000,"DALI",""]
[540001049200,"LEDDLRc-P-MW R200-33W-DALI-4000-WL","CFL 2x32W",33,null,3630,70000,"DALI",""]
[540001049300,"LEDDLRc-P-MW R150-11.5W-BLE-3000-WL","CFL 1x18W",11.5,null,1240,70000,"BLE","Smart"]
[540001049400,"LEDDLRc-P-MW R150-11.5W-BLE-4000-WL","CFL 1x18W",11.5,null,1265,70000,"BLE","Smart"]
[540001049500,"LEDDLRc-P-MW R200-15W-BLE-3000-WL","CFL 1x26W",15,null,1620,70000,"BLE","Smart"]
[540001049600,"LEDDLRc-P-MW R200-15W-BLE-4000-WL","CFL 1x26W",15,null,1650,70000,"BLE","Smart"]
[540001049700,"LEDDLRc-P-MW R200-23W-BLE-3000-WL","CFL 2x26W",23,null,2480,70000,"BLE","Smart"]
[540001049800,"LEDDLRc-P-MW R200-23W-BLE-4000-WL","CFL 2x26W",23,null,2530,70000,"BLE","Smart"]
[540001049900,"LEDDLRc-P-MW R200-33W-BLE-3000-WL","CFL 2x32W",33,null,3560,70000,"BLE",{"$f":"IF(OR(H258=$L$5,H258=$L$6,H258=$L$9),\"Smart\",\"\")","v":"Smart"}]
[540001050000,"LEDDLRc-P-MW R200-33W-BLE-4000-WL","CFL 2x32W",33,null,3630,70000,"BLE","Smart"]
[540001050100,"LEDDLRc-P-HG R150-11.5W-DALI-3000-WL5","CFL 1x18W",11.5,null,1240,70000,"DALI",""]
[540001050200,"LEDDLRc-P-HG R150-11.5W-DALI-4000-WL5","CFL 1x18W",11.5,null,1265,70000,"DALI",""]
[540001050300,"LEDDLRc-P-HG R200-15W-DALI-3000-WL5","CFL 1x26W",15,null,1620,70000,"DALI",""]
[540001050400,"LEDDLRc-P-HG R200-15W-DALI-4000-WL5","CFL 1x26W",15,null,1650,70000,"DALI",""]
[540001050500,"LEDDLRc-P-HG R200-23W-DALI-3000-WL5","CFL 2x26W",23,null,2480,70000,"DALI",""]
[540001050600,"LEDDLRc-P-HG R200-23W-DALI-4000-WL5","CFL 2x26W",23,null,2530,70000,"DALI",""]
[540001050700,"LEDDLRc-P-HG R200-33W-DALI-3000-WL5","CFL 2x32W",33,null,3560,70000,"DALI",""]
[540001050800,"LEDDLRc-P-HG R200-33W-DALI-4000-WL5","CFL 2x32W",33,null,3630,70000,"DALI",""]
[540001050900,"LEDDLRc-P-MW R150-11.5W-DALI-3000-WL5","CFL 1x18W",11.5,null,1240,70000,"DALI",""]
[540001051000,"LEDDLRc-P-MW R150-11.5W-DALI-4000-WL5","CFL 1x18W",11.5,null,1265,70000,"DALI",""]
[540001051100,"LEDDLRc-P-MW R200-15W-DALI-3000-WL5","CFL 1x26W",15,null,1620,70000,"DALI",""]
[540001051200,"LEDDLRc-P-MW R200-15W-DALI-4000-WL5","CFL 1x26W",15,null,1650,70000,"DALI",""]
[540001051300,"LEDDLRc-P-MW R200-23W-DALI-3000-WL5","CFL 2x26W",23,null,2480,70000,"DALI",""]
[540001051400,"LEDDLRc-P-MW R200-23W-DALI-4000-WL5","CFL 2x26W",23,null,2530,70000,"DALI",""]
[540001051500,"LEDDLRc-P-MW R200-33W-DALI-3000-WL5","CFL 2x32W",33,null,3560,70000,"DALI",""]
[540001051600,"LEDDLRc-P-MW R200-33W-DALI-4000-WL5","CFL 2x32W",33,null,3630,70000,"DALI",""]
[540001083800,"LEDDownlightRc-P-HG R200-15W-940","CFL 1x26W",15,null,1650,70000,"On-Off",""]
[540001084000,"LEDDownlightRc-P-HG R200-23W-940","CFL 2x26W",23,null,2530,70000,"On-Off",""]
[540001084600,"LEDDownlightRc-P-HG R200-15W-DALI-940","CFL 1x26W",15,null,1650,70000,"DALI",""]
[540001084800,"LEDDownlightRc-P-HG R200-23W-DALI-940","CFL 2x26W",23,null,2530,70000,"DALI",""]
[540001085400,"LEDDownlightRc-P-HG R200-15W-BLE-940","CFL 1x26W",15,null,1650,70000,"BLE","Smart"]
[540001085600,"LEDDownlightRc-P-HG R200-23W-BLE-940","CFL 2x26W",23,null,2530,70000,"BLE","Smart"]
[540001086200,"LEDDownlightRc-P-MW R200-15W-940","CFL 1x26W",15,null,1650,70000,"On-Off",""]
[540001086400,"LEDDownlightRc-P-MW R200-23W-940","CFL 2x26W",23,null,2530,70000,"On-Off",""]
[540001087000,"LEDDownlightRc-P-MW R200-15W-DALI-940","CFL 1x26W",15,null,1650,70000,"DALI",""]
[540001087200,"LEDDownlightRc-P-MW R200-23W-DALI-940","CFL 2x26W",23,null,2530,70000,"DALI",""]
[540001087800,"LEDDownlightRc-P-MW R200-15W-BLE-940","CFL 1x26W",15,null,1650,70000,"BLE","Smart"]
[540001088000,"LEDDownlightRc-P-MW R200-23W-BLE-940","CFL 2x26W",23,null,2530,70000,"BLE","Smart"]
[540001184800,"LEDDownlightRc-P-HG R200-25W-BLE-TW","CFL 2x26W",25,null,2650,70000,"BLE","Smart"]
[540001184900,"LEDDownlightRc-P-MW R200-25W-BLE-TW","CFL 2x26W",25,null,2650,70000,"BLE","Smart"]
[540001290900,"LEDDownlightCo-E Rd100-9W-830","CFL 1x18W",9,null,810,50000,"On-Off",""]
[540001291000,"LEDDownlightCo-E Rd100-9W-840","CFL 1x18W",9,null,855,50000,"On-Off",""]
[540001291100,"LEDDownlightCo-E Rd125-14W-830","CFL 1x26W",14,null,1190,50000,"On-Off",""]
[540001291200,"LEDDownlightCo-E Rd125-14W-840","CFL 1x26W",14,null,1260,50000,"On-Off",""]
[540001291300,"LEDDownlightCo-E Rd150-18W-830","CFL 1x26W",18,null,1620,50000,"On-Off",""]
[540001291400,"LEDDownlightCo-E Rd150-18W-840","CFL 1x26W",18,null,1710,50000,"On-Off",""]
[540001291500,"LEDDownlightCo-E Rd200-24W-830","CFL 2x26W",24,null,2280,50000,"On-Off",""]
[540001291600,"LEDDownlightCo-E Rd200-24W-840","CFL 2x26W",24,null,2400,50000,"On-Off",""]
[540001295100,"LEDCeilingLu-E Rd87-9W-830-WH","CFL 1x18W",9,null,810,50000,"On-Off",""]
[540001295200,"LEDCeilingLu-E Rd112-14W-830-WH","CFL 1x26W",14,null,1190,50000,"On-Off",""]
[540001295300,"LEDCeilingLu-E Rd142-18W-830-WH","CFL 2x18W",18,null,1620,50000,"On-Off",""]
[540001295400,"LEDCeilingLu-E Rd142-24W-830-WH","CFL 2x26W",24,null,2040,50000,"On-Off",""]
[540001295500,"LEDCeilingLu-E Rd87-9W-830-BL","CFL 1x18W",9,null,810,50000,"On-Off",""]
[540001295600,"LEDCeilingLu-E Rd87-9W-840-BL","CFL 1x18W",9,null,855,50000,"On-Off",""]
[540001295700,"LEDCeilingLu-E Rd112-14W-830-BL","CFL 1x26W",14,null,1190,50000,"On-Off",""]
[540001295800,"LEDCeilingLu-E Rd112-14W-840-BL","CFL 1x26W",14,null,1260,50000,"On-Off",""]
[540001295900,"LEDCeilingLu-E Rd142-18W-830-BL","CFL 2x18W",18,null,1620,50000,"On-Off",""]
[540001296000,"LEDCeilingLu-E Rd142-18W-840-BL","CFL 2x18W",18,null,1710,50000,"On-Off",""]
[540001296100,"LEDCeilingLu-E Rd142-24W-830-BL","CFL 2x26W",24,null,2040,50000,"On-Off",""]
[540001296200,"LEDCeilingLu-E Rd142-24W-840-BL","CFL 2x26W",24,null,2160,50000,"On-Off",""]
[540001296300,"LEDCeilingLu-E Rd87-9W-840-WH","CFL 1x18W",9,null,855,50000,"On-Off",""]
[540001296400,"LEDCeilingLu-E Rd112-14W-840-WH","CFL 1x26W",14,null,1260,50000,"On-Off",""]
[540001296500,"LEDCeilingLu-E Rd142-18W-840-WH","CFL 2x18W",18,null,1710,50000,"On-Off",""]
[540001296600,"LEDCeilingLu-E Rd142-24W-840-WH","CFL 2x26W",24,null,2160,50000,"On-Off",""]
[540001333300,"LEDDownlightRc-P-MW R200-23W-BLE2-3000","CFL 2x26W",23,null,2480,70000,"BLE2","Smart"]
[540001333400,"LEDDownlightRc-P-MW R200-23W-BLE2-4000","CFL 2x26W",23,null,2530,70000,"BLE2","Smart"]
[540001333500,"LEDDownlightRc-P-MW R200-33W-BLE2-3000","CFL 2x32W",33,null,3560,70000,"BLE2","Smart"]
[540001333600,"LEDDownlightRc-P-MW R200-33W-BLE2-4000","CFL 2x32W",33,null,3630,70000,"BLE2","Smart"]
[540001333700,"LEDDownlightRc-P-MW R200-23W-BLE2-940","CFL 2x26W",23,null,2530,70000,"BLE2","Smart"]
[540001333800,"LEDDownlightRc-P-MW R150-11.5W-BLE2-3000","CFL 1x18W",11.5,null,1240,70000,"BLE2","Smart"]
[540001333900,"LEDDownlightRc-P-MW R150-11.5W-BLE2-4000","CFL 1x18W",11.5,null,1265,70000,"BLE2","Smart"]
[540001334000,"LEDDownlightRc-P-MW R200-15W-BLE2-3000","CFL 1x26W",15,null,1620,70000,"BLE2","Smart"]
[540001334100,"LEDDownlightRc-P-MW R200-15W-BLE2-4000","CFL 1x26W",15,null,1650,70000,"BLE2",{"$f":"IF(OR(H322=$L$5,H322=$L$6,H322=$L$9),\"Smart\",\"\")","v":"Smart"}]
[540001334200,"LEDDownlightRc-P-MW R200-25W-BLE2-TW","CFL 2x26W",25,null,2650,70000,"BLE2","Smart"]
[540001334300,"LEDDownlightRc-P-HG R200-23W-BLE2-3000","CFL 2x26W",23,null,2480,70000,"BLE2","Smart"]
[540001334400,"LEDDownlightRc-P-HG R200-23W-BLE2-4000","CFL 2x26W",23,null,2530,70000,"BLE2","Smart"]
[540001334500,"LEDDownlightRc-P-HG R200-33W-BLE2-3000","CFL 2x32W",33,null,3560,70000,"BLE2","Smart"]
[540001334600,"LEDDownlightRc-P-HG R200-33W-BLE2-4000","CFL 2x32W",33,null,3630,70000,"BLE2","Smart"]
[540001334700,"LEDDownlightRc-P-HG R200-23W-BLE2-940","CFL 2x26W",23,null,2530,70000,"BLE2","Smart"]
[540001334800,"LEDDownlightRc-P-HG R150-11.5W-BLE2-3000","CFL 1x18W",11.5,null,1240,70000,"BLE2","Smart"]
[540001334900,"LEDDownlightRc-P-HG R150-11.5W-BLE2-4000","CFL 1x18W",11.5,null,1265,70000,"BLE2","Smart"]
[540001335000,"LEDDownlightRc-P-HG R200-15W-BLE2-3000","CFL 1x26W",15,null,1620,70000,"BLE2","Smart"]
[540001335100,"LEDDownlightRc-P-HG R200-15W-BLE2-4000","CFL 1x26W",15,null,1650,70000,"BLE2","Smart"]
[540001335200,"LEDDownlightRc-P-HG R200-25W-BLE2-TW","CFL 2x26W",25,null,2650,70000,"BLE2","Smart"]
[540001338600,"LEDDLRc-P-HG R150-11.5W-BLE2-3000-WL","CFL 1x18W",11.5,null,1240,70000,"BLE2","Smart"]
[540001338700,"LEDDLRc-P-HG R150-11.5W-BLE2-4000-WL","CFL 1x18W",11.5,null,1265,70000,"BLE2","Smart"]
[540001338800,"LEDDLRc-P-HG R200-15W-BLE2-3000-WL","CFL 1x26W",15,null,1620,70000,"BLE2","Smart"]
[540001338900,"LEDDLRc-P-HG R200-15W-BLE2-4000-WL","CFL 1x26W",15,null,1650,70000,"BLE2","Smart"]
[540001339000,"LEDDLRc-P-HG R200-23W-BLE2-3000-WL","CFL 2x26W",23,null,2480,70000,"BLE2","Smart"]
[540001339100,"LEDDLRc-P-HG R200-23W-BLE2-4000-WL","CFL 2x26W",23,null,2530,70000,"BLE2","Smart"]
[540001339200,"LEDDLRc-P-HG R200-33W-BLE2-3000-WL","CFL 2x32W",33,null,3560,70000,"BLE2","Smart"]
[540001339300,"LEDDLRc-P-HG R200-33W-BLE2-4000-WL","CFL 2x32W",33,null,3630,70000,"BLE2","Smart"]
[540001339400,"LEDDLRc-P-MW R150-11.5W-BLE2-3000-WL","CFL 1x18W",11.5,null,1240,70000,"BLE2","Smart"]
[540001339500,"LEDDLRc-P-MW R150-11.5W-BLE2-4000-WL","CFL 1x18W",11.5,null,1265,70000,"BLE2","Smart"]
[540001339600,"LEDDLRc-P-MW R200-15W-BLE2-3000-WL","CFL 1x26W",15,null,1620,70000,"BLE2","Smart"]
[540001339700,"LEDDLRc-P-MW R200-15W-BLE2-4000-WL","CFL 1x26W",15,null,1650,70000,"BLE2","Smart"]
[540001339800,"LEDDLRc-P-MW R200-23W-BLE2-3000-WL","CFL 2x26W",23,null,2480,70000,"BLE2","Smart"]
[540001339900,"LEDDLRc-P-MW R200-23W-BLE2-4000-WL","CFL 2x26W",23,null,2530,70000,"BLE2","Smart"]
[540001340000,"LEDDLRc-P-MW R200-33W-BLE2-3000-WL","CFL 2x32W",33,null,3560,70000,"BLE2","Smart"]
[540001340100,"LEDDLRc-P-MW R200-33W-BLE2-4000-WL","CFL 2x32W",33,null,3630,70000,"BLE2","Smart"]
[541001044800,"LEDSpot3C-E 30W-3000-24D-WH","HID 50W",30,null,2550,50000,"On-Off",""]
[541001044900,"LEDSpot3C-E 30W-3000-24D-BL","HID 50W",30,null,2550,50000,"On-Off",""]
[541001045000,"LEDSpot3C-E 30W-4000-24D-WH","HID 50W",30,null,2700,50000,"On-Off",""]
[541001045100,"LEDSpot3C-E 30W-4000-24D-BL","HID 50W",30,null,2700,50000,"On-Off",""]
[541001052600,"LEDSpot3C-C-P 35W-4000-36D-BL","HID 50W",35,null,3150,70000,"On-Off",""]
[541001052700,"LEDSpot3C-C-P 25W-3000-36D-BL","HID 35W",25,null,2125,70000,"On-Off",""]
[541001052800,"LEDSpot3C-C-P 35W-3000-36D-BL","HID 50W",35,null,2975,70000,"On-Off",""]
[541001053000,"LEDSpot3C-C-P 25W-4000-36D-BL","HID 35W",25,null,2250,70000,"On-Off",""]
[541001053300,"LEDSpot3C-C-P 35W-4000-36D-WH","HID 50W",35,null,3150,70000,"On-Off",""]
[541001053500,"LEDSpot3C-C-P 35W-3000-36D-WH","HID 50W",35,null,2975,70000,"On-Off",""]
[541001053700,"LEDSpot3C-C-P 25W-4000-36D-WH","HID 35W",25,null,2250,70000,"On-Off",""]
[541001053900,"LEDSpot3C-C-P 25W-3000-36D-WH","HID 35W",25,null,2125,70000,"On-Off",""]
[541001069000,"LEDSpot3C-C-P 12W-Dim-3000-36D-WH","Halogen 100W",12,null,960,70000,"Triac",""]
[541001069300,"LEDSpot3C-C-P 12W-Dim-4000-36D-WH","Halogen 100W",12,null,1020,70000,"Triac",""]
[541001069600,"LEDSpot3C-C-P 12W-Dim-3000-36D-BL","Halogen 100W",12,null,960,70000,"Triac",""]
[541001069900,"LEDSpot3C-C-P 12W-Dim-4000-36D-BL","Halogen 100W",12,null,1020,70000,"Triac",""]
[541001094800,"LEDSpot3C-C-P 37W-BLE-3000-36D-WH","HID 50W",37,null,2960,70000,"BLE","Smart"]
[541001095000,"LEDSpot3C-C-P 37W-BLE-4000-36D-WH","HID 50W",37,null,3145,70000,"BLE","Smart"]
[541001095200,"LEDSpot3C-C-P 37W-BLE-3000-36D-BL","HID 50W",37,null,2960,70000,"BLE","Smart"]
[541001095400,"LEDSpot3C-C-P 37W-BLE-4000-36D-BL","HID 50W",37,null,3145,70000,"BLE","Smart"]
[541001167100,"LEDSpot3C-C-P 37W-BLE2-3000-36D-WH","HID 50W",37,null,2960,70000,"BLE2","Smart"]
[541001167200,"LEDSpot3C-C-P 37W-BLE2-4000-36D-WH","HID 50W",37,null,3145,70000,"BLE2","Smart"]
[541001167300,"LEDSpot3C-C-P 37W-BLE2-3000-36D-BL","HID 50W",37,null,2960,70000,"BLE2","Smart"]
[541001167400,"LEDSpot3C-C-P 37W-BLE2-4000-36D-BL","HID 50W",37,null,3145,70000,"BLE2","Smart"]
[541003067800,"LEDSpotRS-P 20W-3000-60D-WH","HID 35W",20,null,1800,70000,"On-Off",""]
[541003067900,"LEDSpotRS-P 20W-4000-60D-WH","HID 35W",20,null,2000,70000,"On-Off",""]
[541003068200,"LEDSpotRS-P 35W-3000-60D-WH","HID 50W",35,null,3150,70000,"On-Off",""]
[541003068300,"LEDSpotRS-P 35W-4000-60D-WH","HID 50W",35,null,3500,70000,"On-Off",""]
[541003101500,"LEDSpotRS-P 35W-3000-60D-WH-DALI","HID 50W",35,null,3150,70000,"DALI",""]
[541003101600,"LEDSpotRS-P 35W-4000-60D-WH-DALI","HID 50W",35,null,3500,70000,"DALI",""]
[541003101900,"LEDSpotRS-P 35W-3000-60D-WH-BLE","HID 50W",35,null,3150,70000,"BLE","Smart"]
[541003102000,"LEDSpotRS-P 35W-4000-60D-WH-BLE","HID 50W",35,null,3500,70000,"BLE","Smart"]
[541003102300,"LEDSpotRS-P 35W-3000-60D-WH-10V","HID 50W",35,null,3150,70000,"1-10V",""]
[541003102400,"LEDSpotRS-P 35W-4000-60D-WH-10V","HID 50W",35,null,3500,70000,"1-10V",""]
[541003207100,"LEDSpotRA-Ava-E2 5W-Dim-2700-30D-WH","Halogen 35W",5,null,385,50000,"Triac",""]
[541003207300,"LEDSpotRA-Ava-E2 5W-Dim-2700-30D-BA","Halogen 35W",5,null,385,50000,"Triac",""]
[541003207500,"LEDSpotRA-Ava-E2 7W-Dim-2700-30D-WH","Halogen 50W",7,null,520,50000,"Triac",{"$f":"IF(OR(H386=$L$5,H386=$L$6,H386=$L$9),\"Smart\",\"\")","v":""}]
[541003207700,"LEDSpotRA-Ava-E2 7W-Dim-2700-30D-BA","Halogen 50W",7,null,520,50000,"Triac",""]
[541003410800,"LEDSpotRA-Chiara-E 6W-827-36D-AL","Halogen 35W",6,null,450,50000,"On-Off",""]
[541003410900,"LEDSpotRA-Chiara-E 6W-827-36D-WH","Halogen 35W",6,null,450,50000,"On-Off",""]
[541003411000,"LEDSpotRA-Chiara-E 6W-840-36D-AL","Halogen 35W",6,null,480,50000,"On-Off",""]
[541003411100,"LEDSpotRA-Chiara-E 6W-840-36D-WH","Halogen 35W",6,null,480,50000,"On-Off",""]
[541003411200,"LEDSpotRA-Chiara-E 8W-827-36D-AL","Halogen 50W",8,null,600,50000,"On-Off",""]
[541003411300,"LEDSpotRA-Chiara-E 8W-827-36D-WH","Halogen 50W",8,null,600,50000,"On-Off",""]
[541003411400,"LEDSpotRA-Chiara-E 8W-840-36D-AL","Halogen 50W",8,null,640,50000,"On-Off",""]
[541003411500,"LEDSpotRA-Chiara-E 8W-840-36D-WH","Halogen 50W",8,null,640,50000,"On-Off",""]
[541003414200,"LEDSpotRA-Chiara-E 6W-830-36D-AL","Halogen 35W",6,null,450,50000,"On-Off",""]
[541003414300,"LEDSpotRA-Chiara-E 6W-830-36D-WH","Halogen 35W",6,null,450,50000,"On-Off",""]
[541003414400,"LEDSpotRA-Chiara-E 8W-830-36D-AL","Halogen 50W",8,null,600,50000,"On-Off",""]
[541003414500,"LEDSpotRA-Chiara-E 8W-830-36D-WH","Halogen 50W",8,null,600,50000,"On-Off",""]
[541003538200,"LEDSpotRA-Ava-E2 5W-Dim-2700-30D-BL","Halogen 35W",5,null,385,50000,"Triac",""]
[541003538400,"LEDSpotRA-Ava-E2 7W-Dim-2700-30D-BL","Halogen 50W",7,null,520,50000,"Triac",""]
[541003557000,"LEDSpotRS-P 35W-3000-60D-WH-BLE2","HID 50W",35,null,3150,70000,"BLE2","Smart"]
[541003557100,"LEDSpotRS-P 35W-4000-60D-WH-BLE2","HID 50W",35,null,3500,70000,"BLE2","Smart"]
[542003015200,"LEDPanelRc-Mo Sq595-35W-DALI-3000-WH-U19","CFL 1x55W",35,null,4025,70000,"DALI2",""]
[542003015300,"LEDPanelRc-Mo Sq595-35W-DALI-4000-WH-U19","CFL 1x55W",35,null,4200,70000,"DALI2",""]
[542003015600,"LEDPanelRc-Mo Sq595-35W-BLE-3000-WH-U19","CFL 1x55W",35,null,4025,70000,"BLE","Smart"]
[542003015700,"LEDPanelRc-Mo Sq595-35W-BLE-4000-WH-U19","CFL 1x55W",35,null,4200,70000,"BLE","Smart"]
[542003016000,"LEDPanelRc-Mo Sq595-35W-10V-3000-WH-U19","CFL 1x55W",35,null,4025,70000,"1-10V",""]
[542003016100,"LEDPanelRc-Mo Sq595-35W-10V-4000-WH-U19","CFL 1x55W",35,null,4200,70000,"1-10V",""]
[542003016800,"LEDPanelRc-Mo Sq595-35W-3000-WH-U19","CFL 1x55W",35,null,4025,70000,"On-Off",""]
[542003016900,"LEDPanelRc-Mo Sq595-35W-4000-WH-U19","CFL 1x55W",35,null,4200,70000,"On-Off",""]
[542003021100,"LEDPanelRc-S-B2 Sq595-32W-3000-WH","TL 4x18W",32,null,3600,50000,"On-Off",""]
[542003021200,"LEDPanelRc-S-B2 Sq595-32W-3000-WH-U19","TL 4x18W",32,null,3600,50000,"On-Off",""]
[542003021300,"LEDPanelRc-S-B2 Sq595-32W-4000-WH","TL 4x18W",32,null,3680,50000,"On-Off",""]
[542003021400,"LEDPanelRc-S-B2 Sq595-32W-4000-WH-U19","TL 4x18W",32,null,3680,50000,"On-Off",""]
[542003021500,"LEDPanelRc-S-B2 Sq620-32W-4000-WH","TL 4x18W",32,null,3680,50000,"On-Off",""]
[542003021600,"LEDPanelRc-S-B2 Sq620-32W-4000-WH-U19","TL 4x18W",32,null,3680,50000,"On-Off",""]
[542003046400,"LEDPanelRc-S-B2 Re295-32W-3000-WH","TL 2x36W",32,null,3600,50000,"On-Off",""]
[542003046500,"LEDPanelRc-S-B2 Re295-32W-3000-WH-U19","TL 2x36W",32,null,3600,50000,"On-Off",""]
[542003046600,"LEDPanelRc-S-B2 Re295-32W-4000-WH","TL 2x36W",32,null,3680,50000,"On-Off",""]
[542003046700,"LEDPanelRc-S-B2 Re295-32W-4000-WH-U19","TL 2x36W",32,null,3680,50000,"On-Off",""]
[542003083200,"LEDPanelS-E3 Re295-32W-840-U19","TL 2x36W",32,null,4000,60000,"On-Off",""]
[542003083300,"LEDPanelS-E3 Re295-32W-830-U19","TL 2x36W",32,null,3840,60000,"On-Off",""]
[542003083400,"LEDPanelS-E3 Sq620-32W-840-U19","TL 4x18W",32,null,4000,60000,"On-Off",""]
[542003083600,"LEDPanelS-E3 Sq595-32W-840-U19","TL 4x18W",32,null,4000,60000,"On-Off",""]
[542003083700,"LEDPanelS-E3 Sq595-32W-830-U19","TL 4x18W",32,null,3840,60000,"On-Off",""]
[542003096100,"LEDPanelS-B3 Sq595-32W-830","TL 4x18W",32,null,3630,50000,"On-Off",""]
[542003096200,"LEDPanelS-B3 Sq595-32W-840","TL 4x18W",32,null,3840,50000,"On-Off",""]
[542003096300,"LEDPanelS-B3 Sq595-32W-830-U19","TL 4x18W",32,null,3630,50000,"On-Off",""]
[542003096400,"LEDPanelS-B3 Sq595-32W-840-U19","TL 4x18W",32,null,3840,50000,"On-Off",""]
[542003096500,"LEDPanelS-B3 Sq620-32W-830","TL 4x18W",32,null,3630,50000,"On-Off",""]
[542003096600,"LEDPanelS-B3 Sq620-32W-840","TL 4x18W",32,null,3840,50000,"On-Off",""]
[542003096700,"LEDPanelS-B3 Sq620-32W-830-U19","TL 4x18W",32,null,3630,50000,"On-Off",""]
[542003096800,"LEDPanelS-B3 Sq620-32W-840-U19","TL 4x18W",32,null,3840,50000,"On-Off",""]
[542003096900,"LEDPanelS-B3 Re295-32W-830","TL 2x36W",32,null,3630,50000,"On-Off",""]
[542003097000,"LEDPanelS-B3 Re295-32W-840","TL 2x36W",32,null,3840,50000,"On-Off",""]
[542003097100,"LEDPanelS-B3 Re295-32W-830-U19","TL 2x36W",32,null,3630,50000,"On-Off",""]
[542003097200,"LEDPanelS-B3 Re295-32W-840-U19","TL 2x36W",32,null,3840,50000,"On-Off",""]
[542003098500,"LEDPanelS-E4 Sq595-32W-830-U19","TL 4x18W",32,null,4000,60000,"On-Off",""]
[542003098600,"LEDPanelS-E4 Sq595-32W-840-U19","TL 4x18W",32,null,4100,60000,"On-Off",""]
[542003098700,"LEDPanelS-E4 Sq620-32W-830-U19","TL 4x18W",32,null,4000,60000,"On-Off",""]
[542003098800,"LEDPanelS-E4 Sq620-32W-840-U19","TL 4x18W",32,null,4100,60000,"On-Off",""]
[542003098900,"LEDPanelS-E4 Re295-32W-830-U19","TL 2x36W",32,null,4000,60000,"On-Off",""]
[542003099000,"LEDPanelS-E4 Re295-32W-840-U19","TL 2x36W",32,null,4100,60000,"On-Off",""]
[542003099100,"LEDPanelS-E4 Sq595-32W-DALI-830-U19","TL 4x18W",32,null,4000,60000,"DALI2",""]
[542003099200,"LEDPanelS-E4 Sq595-32W-DALI-840-U19","TL 4x18W",32,null,4100,60000,"DALI2",""]
[542003099300,"LEDPanelS-E4 Sq620-32W-DALI-830-U19","TL 4x18W",32,null,4000,60000,"DALI2",""]
[542003099400,"LEDPanelS-E4 Sq620-32W-DALI-840-U19","TL 4x18W",32,null,4100,60000,"DALI2",""]
[542003099500,"LEDPanelS-E4 Re295-32W-DALI-830-U19","TL 2x36W",32,null,4000,60000,"DALI2",""]
[542003099600,"LEDPanelS-E4 Re295-32W-DALI-840-U19","TL 2x36W",32,null,4100,60000,"DALI2",{"$f":"IF(OR(H450=$L$5,H450=$L$6,H450=$L$9),\"Smart\",\"\")","v":""}]
[542003099700,"LEDPanelS-E4 Sq595-32W-830","TL 4x18W",32,null,4000,60000,"On-Off",""]
[542003099800,"LEDPanelS-E4 Sq595-32W-840","TL 4x18W",32,null,4100,60000,"On-Off",""]
[542003099900,"LEDPanelS-E4 Sq620-32W-830","TL 4x18W",32,null,4000,60000,"On-Off",""]
[542003100000,"LEDPanelS-E4 Sq620-32W-840","TL 4x18W",32,null,4100,60000,"On-Off",""]
[542003100100,"LEDPanelS-E4 Re295-32W-830","TL 2x36W",32,null,4000,60000,"On-Off",""]
[542003100200,"LEDPanelS-E4 Re295-32W-840","TL 2x36W",32,null,4100,60000,"On-Off",""]
[542003100300,"LEDPanelS-E4 Sq595-32W-DALI-830","TL 4x18W",32,null,4000,60000,"DALI2",""]
[542003100400,"LEDPanelS-E4 Sq595-32W-DALI-840","TL 4x18W",32,null,4100,60000,"DALI2",""]
[542003100500,"LEDPanelS-E4 Sq620-32W-DALI-830","TL 4x18W",32,null,4000,60000,"DALI2",""]
[542003100600,"LEDPanelS-E4 Sq620-32W-DALI-840","TL 4x18W",32,null,4100,60000,"DALI2",""]
[542003100700,"LEDPanelS-E4 Re295-32W-DALI-830","TL 2x36W",32,null,4000,60000,"DALI2",""]
[542003100800,"LEDPanelS-E4 Re295-32W-DALI-840","TL 2x36W",32,null,4100,60000,"DALI2",""]
[542003108200,"LEDPanelS-P6 Sq595-34W-BLE2-TW-U19","TL 4x18W",34,null,4760,100000,"BLE2","Smart"]
[542003108300,"LEDPanelS-P6 Re295-34W-BLE2-TW-U19","TL 2x36W",34,null,4760,100000,"BLE2","Smart"]
[542003108400,"LEDPanelS-P6 Sq620-34W-BLE2-TW-U19","TL 4x18W",34,null,4760,100000,"BLE2","Smart"]
[542003108500,"LEDPanelS-P6 Sq595-30W-830-U19","TL 4x18W",30,null,3900,100000,"On-Off",""]
[542003108600,"LEDPanelS-P6 Sq595-30W-840-U19","TL 4x18W",30,null,4200,100000,"On-Off",""]
[542003108700,"LEDPanelS-P6 Re295-30W-830-U19","TL 2x36W",30,null,3900,100000,"On-Off",""]
[542003108800,"LEDPanelS-P6 Re295-30W-840-U19","TL 2x36W",30,null,4200,100000,"On-Off",""]
[542003108900,"LEDPanelS-P6 Sq620-30W-830-U19","TL 4x18W",30,null,3900,100000,"On-Off",""]
[542003109000,"LEDPanelS-P6 Sq620-30W-840-U19","TL 4x18W",30,null,4200,100000,"On-Off",""]
[542003109100,"LEDPanelS-P6 Sq620-30W-865-U19","TL 4x18W",30,null,4200,100000,"On-Off",""]
[542003109200,"LEDPanelS-P6 Sq595-30W-DALI-830-U19","TL 4x18W",30,null,3900,100000,"DALI2",""]
[542003109300,"LEDPanelS-P6 Sq595-30W-DALI-840-U19","TL 4x18W",30,null,4200,100000,"DALI2",""]
[542003109400,"LEDPanelS-P6 Re295-30W-DALI-830-U19","TL 2x36W",30,null,3900,100000,"DALI2",""]
[542003109500,"LEDPanelS-P6 Re295-30W-DALI-840-U19","TL 2x36W",30,null,4200,100000,"DALI2",""]
[542003109600,"LEDPanelS-P6 Sq620-30W-DALI-830-U19","TL 4x18W",30,null,3900,100000,"DALI2",""]
[542003109700,"LEDPanelS-P6 Sq620-30W-DALI-840-U19","TL 4x18W",30,null,4200,100000,"DALI2",""]
[542003109800,"LEDPanelS-P6 Sq620-30W-DALI-865-U19","TL 4x18W",30,null,4200,100000,"DALI2",""]
[542003109900,"LEDPanelS-P6 Sq595-30W-BLE2-830-U19","TL 4x18W",30,null,3900,100000,"BLE2","Smart"]
[542003110000,"LEDPanelS-P6 Sq595-30W-BLE2-840-U19","TL 4x18W",30,null,4200,100000,"BLE2","Smart"]
[542003110100,"LEDPanelS-P6 Re295-30W-BLE2-830-U19","TL 2x36W",30,null,3900,100000,"BLE2","Smart"]
[542003110200,"LEDPanelS-P6 Re295-30W-BLE2-840-U19","TL 2x36W",30,null,4200,100000,"BLE2","Smart"]
[542003110300,"LEDPanelS-P6 Sq620-30W-BLE2-830-U19","TL 4x18W",30,null,3900,100000,"BLE2","Smart"]
[542003110400,"LEDPanelS-P6 Sq620-30W-BLE2-840-U19","TL 4x18W",30,null,4200,100000,"BLE2","Smart"]
[542003110500,"LEDPanelS-P6 Sq620-30W-BLE2-865-U19","TL 4x18W",30,null,4200,100000,"BLE2","Smart"]
[542003110600,"LEDPanelS-P6 Sq595-30W-10V-830-U19","TL 4x18W",30,null,3900,100000,"1-10V",""]
[542003110700,"LEDPanelS-P6 Sq595-30W-10V-840-U19","TL 4x18W",30,null,4200,100000,"1-10V",""]
[542003110800,"LEDPanelS-P6 Re295-30W-10V-830-U19","TL 2x36W",30,null,3900,100000,"1-10V",""]
[542003110900,"LEDPanelS-P6 Re295-30W-10V-840-U19","TL 2x36W",30,null,4200,100000,"1-10V",""]
[542003111000,"LEDPanelS-P6 Sq620-30W-10V-830-U19","TL 4x18W",30,null,3900,100000,"1-10V",""]
[542003111100,"LEDPanelS-P6 Sq620-30W-10V-840-U19","TL 4x18W",30,null,4200,100000,"1-10V",""]
[542003111200,"LEDPanelS-P6 Sq620-30W-10V-865-U19","TL 4x18W",30,null,4200,100000,"1-10V",""]
[542003111300,"LEDPanelS-P6 Sq595-34W-830-U19","TL 4x18W",34,null,4420,100000,"On-Off",""]
[542003111400,"LEDPanelS-P6 Sq595-34W-840-U19","TL 4x18W",34,null,4760,100000,"On-Off",""]
[542003111500,"LEDPanelS-P6 Re295-34W-830-U19","TL 2x36W",34,null,4420,100000,"On-Off",""]
[542003111600,"LEDPanelS-P6 Re295-34W-840-U19","TL 2x36W",34,null,4760,100000,"On-Off",""]
[542003111700,"LEDPanelS-P6 Sq620-34W-830-U19","TL 4x18W",34,null,4420,100000,"On-Off",""]
[542003111800,"LEDPanelS-P6 Sq620-34W-840-U19","TL 4x18W",34,null,4760,100000,"On-Off",""]
[542003111900,"LEDPanelS-P6 Sq620-34W-865-U19","TL 4x18W",34,null,4760,100000,"On-Off",""]
[542003112000,"LEDPanelS-P6 Sq595-34W-DALI-830-U19","TL 4x18W",34,null,4420,100000,"DALI2",""]
[542003112100,"LEDPanelS-P6 Sq595-34W-DALI-840-U19","TL 4x18W",34,null,4760,100000,"DALI2",""]
[542003112200,"LEDPanelS-P6 Re295-34W-DALI-830-U19","TL 2x36W",34,null,4420,100000,"DALI2",""]
[542003112300,"LEDPanelS-P6 Re295-34W-DALI-840-U19","TL 2x36W",34,null,4760,100000,"DALI2",""]
[542003112400,"LEDPanelS-P6 Sq620-34W-DALI-830-U19","TL 4x18W",34,null,4420,100000,"DALI2",""]
[542003112500,"LEDPanelS-P6 Sq620-34W-DALI-840-U19","TL 4x18W",34,null,4760,100000,"DALI2",""]
[542003112600,"LEDPanelS-P6 Sq620-34W-DALI-865-U19","TL 4x18W",34,null,4760,100000,"DALI2",""]
[542003112700,"LEDPanelS-P6 Sq595-34W-BLE2-830-U19","TL 4x18W",34,null,4420,100000,"BLE2","Smart"]
[542003112800,"LEDPanelS-P6 Sq595-34W-BLE2-840-U19","TL 4x18W",34,null,4760,100000,"BLE2","Smart"]
[542003112900,"LEDPanelS-P6 Re295-34W-BLE2-830-U19","TL 2x36W",34,null,4420,100000,"BLE2","Smart"]
[542003113000,"LEDPanelS-P6 Re295-34W-BLE2-840-U19","TL 2x36W",34,null,4760,100000,"BLE2","Smart"]
[542003113100,"LEDPanelS-P6 Sq620-34W-BLE2-830-U19","TL 4x18W",34,null,4420,100000,"BLE2","Smart"]
[542003113200,"LEDPanelS-P6 Sq620-34W-BLE2-840-U19","TL 4x18W",34,null,4760,100000,"BLE2","Smart"]
[542003113300,"LEDPanelS-P6 Sq620-34W-BLE2-865-U19","TL 4x18W",34,null,4760,100000,"BLE2",{"$f":"IF(OR(H514=$L$5,H514=$L$6,H514=$L$9),\"Smart\",\"\")","v":"Smart"}]
[542003113400,"LEDPanelS-P6 Sq595-34W-940-U19","TL 4x18W",34,null,4080,100000,"On-Off",""]
[542003113500,"LEDPanelS-P6 Re295-34W-940-U19","TL 2x36W",34,null,4080,100000,"On-Off",""]
[542003113600,"LEDPanelS-P6 Sq620-34W-940-U19","TL 4x18W",34,null,4080,100000,"On-Off",""]
[542003113700,"LEDPanelS-P6 Sq595-34W-DALI-940-U19","TL 4x18W",34,null,4080,100000,"DALI2",""]
[542003113800,"LEDPanelS-P6 Re295-34W-DALI-940-U19","TL 2x36W",34,null,4080,100000,"DALI2",""]
[542003113900,"LEDPanelS-P6 Sq620-34W-DALI-940-U19","TL 4x18W",34,null,4080,100000,"DALI2",""]
[542003114000,"LEDPanelS-P6 Sq595-34W-BLE2-940-U19","TL 4x18W",34,null,4080,100000,"BLE2","Smart"]
[542003114100,"LEDPanelS-P6 Re295-34W-BLE2-940-U19","TL 2x36W",34,null,4080,100000,"BLE2","Smart"]
[542003114200,"LEDPanelS-P6 Sq620-34W-BLE2-940-U19","TL 4x18W",34,null,4080,100000,"BLE2","Smart"]
[542003114500,"LEDPanelS-P6 Sq595-30W-830-U19-WL","TL 4x18W",30,null,3900,100000,"On-Off",""]
[542003114600,"LEDPanelS-P6 Sq595-30W-840-U19-WL","TL 4x18W",30,null,4200,100000,"On-Off",""]
[542003114700,"LEDPanelS-P6 Re295-30W-830-U19-WL","TL 2x36W",30,null,3900,100000,"On-Off",""]
[542003114800,"LEDPanelS-P6 Re295-30W-840-U19-WL","TL 2x36W",30,null,4200,100000,"On-Off",""]
[542003114900,"LEDPanelS-P6 Sq595-34W-940-U19-WL","TL 4x18W",34,null,4080,100000,"On-Off",""]
[542003115000,"LEDPanelS-P6 Re295-34W-940-U19-WL","TL 2x36W",34,null,4080,100000,"On-Off",""]
[542003115100,"LEDPanelS-P6 Sq595-30W-DALI-830-U19-WL","TL 4x18W",30,null,3900,100000,"DALI2",""]
[542003115200,"LEDPanelS-P6 Sq595-30W-DALI-840-U19-WL","TL 4x18W",30,null,4200,100000,"DALI2",""]
[542003115300,"LEDPanelS-P6 Re295-30W-DALI-830-U19-WL","TL 2x36W",30,null,3900,100000,"DALI2",""]
[542003115400,"LEDPanelS-P6 Re295-30W-DALI-840-U19-WL","TL 2x36W",30,null,4200,100000,"DALI2",""]
[542003115500,"LEDPanelS-P6 Sq595-34W-DALI-940-U19-WL","TL 4x18W",34,null,4080,100000,"DALI2",""]
[542003115600,"LEDPanelS-P6 Re295-34W-DALI-940-U19-WL","TL 2x36W",34,null,4080,100000,"DALI2",""]
[542003115700,"LEDPanelS-P6 Sq595-30W-BLE2-830-U19-WL","TL 4x18W",30,null,3900,100000,"BLE2","Smart"]
[542003115800,"LEDPanelS-P6 Sq595-30W-BLE2-840-U19-WL","TL 4x18W",30,null,4200,100000,"BLE2","Smart"]
[542003115900,"LEDPanelS-P6 Re295-30W-BLE2-830-U19-WL","TL 2x36W",30,null,3900,100000,"BLE2","Smart"]
[542003116000,"LEDPanelS-P6 Re295-30W-BLE2-840-U19-WL","TL 2x36W",30,null,4200,100000,"BLE2","Smart"]
[542003116100,"LEDPanelS-P6 Sq595-34W-BLE2-940-U19-WL","TL 4x18W",34,null,4080,100000,"BLE2","Smart"]
[542003116200,"LEDPanelS-P6 Re295-34W-BLE2-940-U19-WL","TL 2x36W",34,null,4080,100000,"BLE2","Smart"]
[542003131100,"LEDPanelRc-G Sq598-33W-BLE2-3000-WH-CT","TL 4x18W",33,null,4200,70000,"BLE2","Smart"]
[542003131200,"LEDPanelRc-G Sq598-33W-BLE2-4000-WH-CT","TL 4x18W",33,null,4300,70000,"BLE2","Smart"]
[542003131300,"LEDPanelRc-G Re298-33W-BLE2-3000-WH-CT","TL 2x36W",33,null,4200,70000,"BLE2","Smart"]
[542003131400,"LEDPanelRc-G Re298-33W-BLE2-4000-WH-CT","TL 2x36W",33,null,4300,70000,"BLE2","Smart"]
[542003131500,"LEDLima L12-15W-3000-U19-BLE2","TL 1x28W",15,null,1725,70000,"BLE2","Smart"]
[542003131600,"LEDLima L12-15W-4000-U19-BLE2","TL 1x28W",15,null,1800,70000,"BLE2","Smart"]
[542003131700,"LEDLima L15-18W-3000-U19-BLE2","TL 1x35W",18,null,2070,70000,"BLE2","Smart"]
[542003131800,"LEDLima L15-18W-4000-U19-BLE2","TL 1x35W",18,null,2160,70000,"BLE2","Smart"]
[542003131900,"LEDLima L12-30W-3000-BLE2","TL 1x54W",30,null,3300,70000,"BLE2","Smart"]
[542003132000,"LEDLima L12-30W-4000-BLE2","TL 1x54W",30,null,3450,70000,"BLE2","Smart"]
[542003132100,"LEDLima L15-36W-3000-BLE2","TL 1x80W",36,null,3960,70000,"BLE2","Smart"]
[542003132200,"LEDLima L15-36W-4000-BLE2","TL 1x80W",36,null,4140,70000,"BLE2","Smart"]
[542004021800,"LEDPanelRc-S4 Re295-30W-BLE-4000-U19-WL","TL 2x36W",30,null,3500,70000,"BLE","Smart"]
[542004067600,"LEDPanelRc-S5 Sq595-34W-BLE-TW-U19","TL 4x18W",34,null,4100,100000,"BLE","Smart"]
[542004067800,"LEDPanelRc-S5 Sq620-34W-BLE-TW-U19","TL 4x18W",34,null,4100,100000,"BLE","Smart"]
[542004068200,"LEDPanelRc-S5 Sq595-30W-830-U19","TL 4x18W",30,null,3750,100000,"On-Off",""]
[542004068300,"LEDPanelRc-S5 Sq595-30W-840-U19","TL 4x18W",30,null,3900,100000,"On-Off",""]
[542004068400,"LEDPanelRc-S5 Re295-30W-830-U19","TL 2x36W",30,null,3750,100000,"On-Off",""]
[542004068500,"LEDPanelRc-S5 Re295-30W-840-U19","TL 2x36W",30,null,3900,100000,"On-Off",""]
[542004068600,"LEDPanelRc-S5 Sq620-30W-830-U19","TL 4x18W",30,null,3750,100000,"On-Off",""]
[542004068700,"LEDPanelRc-S5 Sq620-30W-840-U19","TL 4x18W",30,null,3900,100000,"On-Off",""]
[542004068800,"LEDPanelRc-S5 Sq620-30W-865-U19","TL 4x18W",30,null,3900,100000,"On-Off",""]
[542004068900,"LEDPanelRc-S5 Sq595-30W-DALI-830-U19","TL 4x18W",30,null,3750,100000,"DALI",""]
[542004069000,"LEDPanelRc-S5 Sq595-30W-DALI-840-U19","TL 4x18W",30,null,3900,100000,"DALI",""]
[542004069100,"LEDPanelRc-S5 Re295-30W-DALI-830-U19","TL 2x36W",30,null,3750,100000,"DALI",""]
[542004069200,"LEDPanelRc-S5 Re295-30W-DALI-840-U19","TL 2x36W",30,null,3900,100000,"DALI",""]
[542004069300,"LEDPanelRc-S5 Sq620-30W-DALI-830-U19","TL 4x18W",30,null,3750,100000,"DALI",""]
[542004069400,"LEDPanelRc-S5 Sq620-30W-DALI-840-U19","TL 4x18W",30,null,3900,100000,"DALI",""]
[542004069500,"LEDPanelRc-S5 Sq620-30W-DALI-865-U19","TL 4x18W",30,null,3900,100000,"DALI",""]
[542004069600,"LEDPanelRc-S5 Sq595-30W-BLE-830-U19","TL 4x18W",30,null,3750,100000,"BLE","Smart"]
[542004069700,"LEDPanelRc-S5 Sq595-30W-BLE-840-U19","TL 4x18W",30,null,3900,100000,"BLE","Smart"]
[542004069800,"LEDPanelRc-S5 Re295-30W-BLE-830-U19","TL 2x36W",30,null,3750,100000,"BLE","Smart"]
[542004069900,"LEDPanelRc-S5 Re295-30W-BLE-840-U19","TL 2x36W",30,null,3900,100000,"BLE","Smart"]
[542004070000,"LEDPanelRc-S5 Sq620-30W-BLE-830-U19","TL 4x18W",30,null,3750,100000,"BLE","Smart"]
[542004070100,"LEDPanelRc-S5 Sq620-30W-BLE-840-U19","TL 4x18W",30,null,3900,100000,"BLE","Smart"]
[542004070200,"LEDPanelRc-S5 Sq620-30W-BLE-865-U19","TL 4x18W",30,null,3900,100000,"BLE","Smart"]
[542004070300,"LEDPanelRc-S5 Sq595-30W-10V-830-U19","TL 4x18W",30,null,3750,100000,"1-10V",{"$f":"IF(OR(H578=$L$5,H578=$L$6,H578=$L$9),\"Smart\",\"\")","v":""}]
[542004070400,"LEDPanelRc-S5 Sq595-30W-10V-840-U19","TL 4x18W",30,null,3900,100000,"1-10V",""]
[542004070500,"LEDPanelRc-S5 Re295-30W-10V-830-U19","TL 2x36W",30,null,3750,100000,"1-10V",""]
[542004070600,"LEDPanelRc-S5 Re295-30W-10V-840-U19","TL 2x36W",30,null,3900,100000,"1-10V",""]
[542004070700,"LEDPanelRc-S5 Sq620-30W-10V-830-U19","TL 4x18W",30,null,3750,100000,"1-10V",""]
[542004070800,"LEDPanelRc-S5 Sq620-30W-10V-840-U19","TL 4x18W",30,null,3900,100000,"1-10V",""]
[542004070900,"LEDPanelRc-S5 Sq620-30W-10V-865-U19","TL 4x18W",30,null,3900,100000,"1-10V",""]
[542004071000,"LEDPanelRc-S5 Sq595-34W-830-U19","TL 4x18W",34,null,4250,100000,"On-Off",""]
[542004071100,"LEDPanelRc-S5 Sq595-34W-840-U19","TL 4x18W",34,null,4420,100000,"On-Off",""]
[542004071200,"LEDPanelRc-S5 Re295-34W-830-U19","TL 2x36W",34,null,4250,100000,"On-Off",""]
[542004071300,"LEDPanelRc-S5 Re295-34W-840-U19","TL 2x36W",34,null,4420,100000,"On-Off",""]
[542004071400,"LEDPanelRc-S5 Sq620-34W-830-U19","TL 4x18W",34,null,4250,100000,"On-Off",""]
[542004071500,"LEDPanelRc-S5 Sq620-34W-840-U19","TL 4x18W",34,null,4420,100000,"On-Off",""]
[542004071600,"LEDPanelRc-S5 Sq620-34W-865-U19","TL 4x18W",34,null,4420,100000,"On-Off",""]
[542004071700,"LEDPanelRc-S5 Sq595-34W-DALI-830-U19","TL 4x18W",34,null,4250,100000,"DALI",""]
[542004071800,"LEDPanelRc-S5 Sq595-34W-DALI-840-U19","TL 4x18W",34,null,4420,100000,"DALI",""]
[542004071900,"LEDPanelRc-S5 Re295-34W-DALI-830-U19","TL 2x36W",34,null,4250,100000,"DALI",""]
[542004072000,"LEDPanelRc-S5 Re295-34W-DALI-840-U19","TL 2x36W",34,null,4420,100000,"DALI",""]
[542004072100,"LEDPanelRc-S5 Sq620-34W-DALI-830-U19","TL 4x18W",34,null,4250,100000,"DALI",""]
[542004072200,"LEDPanelRc-S5 Sq620-34W-DALI-840-U19","TL 4x18W",34,null,4420,100000,"DALI",""]
[542004072300,"LEDPanelRc-S5 Sq620-34W-DALI-865-U19","TL 4x18W",34,null,4420,100000,"DALI",""]
[542004072400,"LEDPanelRc-S5 Sq595-34W-BLE-830-U19","TL 4x18W",34,null,4250,100000,"BLE","Smart"]
[542004072500,"LEDPanelRc-S5 Sq595-34W-BLE-840-U19","TL 4x18W",34,null,4420,100000,"BLE","Smart"]
[542004072600,"LEDPanelRc-S5 Re295-34W-BLE-830-U19","TL 2x36W",34,null,4250,100000,"BLE","Smart"]
[542004072700,"LEDPanelRc-S5 Re295-34W-BLE-840-U19","TL 2x36W",34,null,4420,100000,"BLE","Smart"]
[542004072800,"LEDPanelRc-S5 Sq620-34W-BLE-830-U19","TL 4x18W",34,null,4250,100000,"BLE","Smart"]
[542004072900,"LEDPanelRc-S5 Sq620-34W-BLE-840-U19","TL 4x18W",34,null,4420,100000,"BLE","Smart"]
[542004073000,"LEDPanelRc-S5 Sq620-34W-BLE-865-U19","TL 4x18W",34,null,4420,100000,"BLE","Smart"]
[542004073100,"LEDPanelRc-S5 Sq595-34W-10V-830-U19","TL 4x18W",34,null,4250,100000,"1-10V",""]
[542004073200,"LEDPanelRc-S5 Sq595-34W-10V-840-U19","TL 4x18W",34,null,4420,100000,"1-10V",""]
[542004073300,"LEDPanelRc-S5 Re295-34W-10V-830-U19","TL 2x36W",34,null,4250,100000,"1-10V",""]
[542004073400,"LEDPanelRc-S5 Re295-34W-10V-840-U19","TL 2x36W",34,null,4420,100000,"1-10V",""]
[542004073500,"LEDPanelRc-S5 Sq620-34W-10V-830-U19","TL 4x18W",34,null,4250,100000,"1-10V",""]
[542004073600,"LEDPanelRc-S5 Sq620-34W-10V-840-U19","TL 4x18W",34,null,4420,100000,"1-10V",""]
[542004073700,"LEDPanelRc-S5 Sq620-34W-10V-865-U19","TL 4x18W",34,null,4420,100000,"1-10V",""]
[542004074600,"LEDPanelRc-S5 Sq595-34W-940-U19","TL 4x18W",34,null,3910,100000,"On-Off",""]
[542004074800,"LEDPanelRc-S5 Re295-34W-940-U19","TL 2x36W",34,null,3910,100000,"On-Off",""]
[542004075000,"LEDPanelRc-S5 Sq620-34W-940-U19","TL 4x18W",34,null,3910,100000,"On-Off",""]
[542004075200,"LEDPanelRc-S5 Sq595-34W-DALI-940-U19","TL 4x18W",34,null,3910,100000,"DALI",""]
[542004075400,"LEDPanelRc-S5 Re295-34W-DALI-940-U19","TL 2x36W",34,null,3910,100000,"DALI",""]
[542004075600,"LEDPanelRc-S5 Sq620-34W-DALI-940-U19","TL 4x18W",34,null,3910,100000,"DALI",""]
[542004075800,"LEDPanelRc-S5 Sq595-34W-BLE-940-U19","TL 4x18W",34,null,3910,100000,"BLE","Smart"]
[542004076000,"LEDPanelRc-S5 Re295-34W-BLE-940-U19","TL 2x36W",34,null,3910,100000,"BLE","Smart"]
[542004076200,"LEDPanelRc-S5 Sq620-34W-BLE-940-U19","TL 4x18W",34,null,3910,100000,"BLE","Smart"]
[542004076400,"LEDPanelRc-S5 Sq595-34W-10V-940-U19","TL 4x18W",34,null,3910,100000,"1-10V",""]
[542004076600,"LEDPanelRc-S5 Re295-34W-10V-940-U19","TL 2x36W",34,null,3910,100000,"1-10V",""]
[542004076800,"LEDPanelRc-S5 Sq620-34W-10V-940-U19","TL 4x18W",34,null,3910,100000,"1-10V",""]
[542004080800,"LEDPanelRc-S5 Sq595-30W-830-U19-WL","TL 4x18W",30,null,3750,100000,"On-Off",""]
[542004080900,"LEDPanelRc-S5 Sq595-30W-840-U19-WL","TL 4x18W",30,null,3900,100000,"On-Off",""]
[542004081000,"LEDPanelRc-S5 Re295-30W-830-U19-WL","TL 2x36W",30,null,3750,100000,"On-Off",""]
[542004081100,"LEDPanelRc-S5 Re295-30W-840-U19-WL","TL 2x36W",30,null,3900,100000,"On-Off",""]
[542004081200,"LEDPanelRc-S5 Sq595-34W-940-U19-WL","TL 4x18W",34,null,3910,100000,"On-Off",""]
[542004081300,"LEDPanelRc-S5 Re295-34W-940-U19-WL","TL 2x36W",34,null,3910,100000,"On-Off",""]
[542004081400,"LEDPanelRc-S5 Sq595-30W-DALI-830-U19-WL","TL 4x18W",30,null,3750,100000,"DALI",""]
[542004081500,"LEDPanelRc-S5 Sq595-30W-DALI-840-U19-WL","TL 4x18W",30,null,3900,100000,"DALI",""]
[542004081600,"LEDPanelRc-S5 Re295-30W-DALI-830-U19-WL","TL 2x36W",30,null,3750,100000,"DALI",""]
[542004081700,"LEDPanelRc-S5 Re295-30W-DALI-840-U19-WL","TL 2x36W",30,null,3900,100000,"DALI",""]
[542004081800,"LEDPanelRc-S5 Sq595-34W-DALI-940-U19-WL","TL 4x18W",34,null,3910,100000,"DALI",""]
[542004081900,"LEDPanelRc-S5 Re295-34W-DALI-940-U19-WL","TL 2x36W",34,null,3910,100000,"DALI",""]
[542004082000,"LEDPanelRc-S5 Sq595-30W-BLE-830-U19-WL","TL 4x18W",30,null,3750,100000,"BLE","Smart"]
[542004082100,"LEDPanelRc-S5 Sq595-30W-BLE-840-U19-WL","TL 4x18W",30,null,3900,100000,"BLE","Smart"]
[542004082200,"LEDPanelRc-S5 Re295-30W-BLE-830-U19-WL","TL 2x36W",30,null,3750,100000,"BLE","Smart"]
[542004082300,"LEDPanelRc-S5 Re295-30W-BLE-840-U19-WL","TL 2x36W",30,null,3900,100000,"BLE","Smart"]
[542004082400,"LEDPanelRc-S5 Sq595-34W-BLE-940-U19-WL","TL 4x18W",34,null,3910,100000,"BLE","Smart"]
[542004082500,"LEDPanelRc-S5 Re295-34W-BLE-940-U19-WL","TL 2x36W",34,null,3910,100000,"BLE",{"$f":"IF(OR(H642=$L$5,H642=$L$6,H642=$L$9),\"Smart\",\"\")","v":"Smart"}]
[542004091700,"LEDPanelSp-Z L1222-80W-BLE2-3000-AL","TL 2x58W",80,null,8600,60000,"BLE2","Smart"]
[542004091800,"LEDPanelSp-Z L1222-80W-BLE2-4000-AL","TL 2x58W",80,null,8600,60000,"BLE2","Smart"]
[542004091900,"LEDPanelRc-Sy Sq595-35W-BLE2-3000-WH-U19","TL 4x18W",35,null,3600,70000,"BLE2","Smart"]
[542004092000,"LEDPanelRc-Sy Sq595-35W-BLE2-4000-WH-U19","TL 4x18W",35,null,3800,70000,"BLE2","Smart"]
[542004092100,"LEDPanelRc-Sy Re295-35W-BLE2-3000-WH-U19","TL 2x36W",35,null,3600,70000,"BLE2","Smart"]
[542004092200,"LEDPanelRc-Sy Re295-35W-BLE2-4000-WH-U19","TL 2x36W",35,null,3800,70000,"BLE2","Smart"]
[542004092300,"LEDPanelRc-Mo Sq595-35W-BLE2-3000-WH-U19","CFL 1x55W",35,null,4025,70000,"BLE2","Smart"]
[542004092400,"LEDPanelRc-Mo Sq595-35W-BLE2-4000-WH-U19","CFL 1x55W",35,null,4200,70000,"BLE2","Smart"]
[542004093000,"LEDPanelRc-S5 Sq595-34W-BLE2-TW-U19","TL 4x18W",34,null,4100,100000,"BLE2","Smart"]
[542004093100,"LEDPanelRc-S5 Sq620-34W-BLE2-TW-U19","TL 4x18W",34,null,4100,100000,"BLE2","Smart"]
[542004093200,"LEDPanelRc-S5 Sq595-30W-BLE2-830-U19","TL 4x18W",30,null,3750,100000,"BLE2","Smart"]
[542004093300,"LEDPanelRc-S5 Sq595-30W-BLE2-840-U19","TL 4x18W",30,null,3900,100000,"BLE2","Smart"]
[542004093400,"LEDPanelRc-S5 Re295-30W-BLE2-830-U19","TL 2x36W",30,null,3750,100000,"BLE2","Smart"]
[542004093500,"LEDPanelRc-S5 Re295-30W-BLE2-840-U19","TL 2x36W",30,null,3900,100000,"BLE2","Smart"]
[542004093600,"LEDPanelRc-S5 Sq620-30W-BLE2-830-U19","TL 4x18W",30,null,3750,100000,"BLE2","Smart"]
[542004093700,"LEDPanelRc-S5 Sq620-30W-BLE2-840-U19","TL 4x18W",30,null,3900,100000,"BLE2","Smart"]
[542004093800,"LEDPanelRc-S5 Sq620-30W-BLE2-865-U19","TL 4x18W",30,null,3900,100000,"BLE2","Smart"]
[542004093900,"LEDPanelRc-S5 Sq595-34W-BLE2-830-U19","TL 4x18W",34,null,4250,100000,"BLE2","Smart"]
[542004094000,"LEDPanelRc-S5 Sq595-34W-BLE2-840-U19","TL 4x18W",34,null,4420,100000,"BLE2","Smart"]
[542004094100,"LEDPanelRc-S5 Re295-34W-BLE2-830-U19","TL 2x36W",34,null,4250,100000,"BLE2","Smart"]
[542004094200,"LEDPanelRc-S5 Re295-34W-BLE2-840-U19","TL 2x36W",34,null,4420,100000,"BLE2","Smart"]
[542004094300,"LEDPanelRc-S5 Sq620-34W-BLE2-830-U19","TL 4x18W",34,null,4250,100000,"BLE2","Smart"]
[542004094400,"LEDPanelRc-S5 Sq620-34W-BLE2-840-U19","TL 4x18W",34,null,4420,100000,"BLE2","Smart"]
[542004094500,"LEDPanelRc-S5 Sq620-34W-BLE2-865-U19","TL 4x18W",34,null,4420,100000,"BLE2","Smart"]
[542004094600,"LEDPanelRc-S5 Sq595-34W-BLE2-940-U19","TL 4x18W",34,null,3910,100000,"BLE2","Smart"]
[542004094700,"LEDPanelRc-S5 Re295-34W-BLE2-940-U19","TL 2x36W",34,null,3910,100000,"BLE2","Smart"]
[542004094800,"LEDPanelRc-S5 Sq620-34W-BLE2-940-U19","TL 4x18W",34,null,3910,100000,"BLE2","Smart"]
[542005000500,"LEDLima L12-15W-3000-U19-DALI","TL 1x28W",15,null,1725,70000,"DALI",""]
[542005000600,"LEDLima L12-15W-4000-U19-DALI","TL 1x28W",15,null,1800,70000,"DALI",""]
[542005000700,"LEDLima L15-18W-3000-U19-DALI","TL 1x35W",18,null,2070,70000,"DALI",""]
[542005000800,"LEDLima L15-18W-4000-U19-DALI","TL 1x35W",18,null,2160,70000,"DALI",""]
[542005001300,"LEDLima L12-30W-3000-DALI","TL 1x54W",30,null,3300,70000,"DALI",""]
[542005001400,"LEDLima L12-30W-4000-DALI","TL 1x54W",30,null,3450,70000,"DALI",""]
[542005001500,"LEDLima L15-36W-3000-DALI","TL 1x80W",36,null,3960,70000,"DALI",""]
[542005001600,"LEDLima L15-36W-4000-DALI","TL 1x80W",36,null,4140,70000,"DALI",""]
[542005004200,"LEDLima L15-36W-4000-BLE","TL 1x80W",36,null,4140,70000,"BLE","Smart"]
[542005004300,"LEDLima L15-36W-3000-BLE","TL 1x80W",36,null,3960,70000,"BLE","Smart"]
[542005004400,"LEDLima L12-30W-4000-BLE","TL 1x54W",30,null,3450,70000,"BLE","Smart"]
[542005004500,"LEDLima L12-30W-3000-BLE","TL 1x54W",30,null,3300,70000,"BLE","Smart"]
[542005004600,"LEDLima L15-18W-4000-U19-BLE","TL 1x35W",18,null,2160,70000,"BLE","Smart"]
[542005004700,"LEDLima L15-18W-3000-U19-BLE","TL 1x35W",18,null,2070,70000,"BLE","Smart"]
[542005004800,"LEDLima L12-15W-4000-U19-BLE","TL 1x28W",15,null,1800,70000,"BLE","Smart"]
[542005004900,"LEDLima L12-15W-3000-U19-BLE","TL 1x28W",15,null,1725,70000,"BLE","Smart"]
[542005005800,"LEDTrunking Module L15-50W-4000-120","TL 2x80W",50,null,8000,70000,"On-Off",""]
[542005005900,"LEDTrunking Module L15-50W-4000-90","TL 2x80W",50,null,8000,70000,"On-Off",""]
[542005006000,"LEDTrunking Module L15-50W-4000-60","TL 2x80W",50,null,8000,70000,"On-Off",""]
[542005006100,"LEDTrunking Module L15-50W-4000-BW","TL 2x80W",50,null,8000,70000,"On-Off",""]
[542005006200,"LEDTrunking Module L15-70W-4000-120","2x TLM 140W RS",70,null,11200,70000,"On-Off",""]
[542005006300,"LEDTrunking Module L15-70W-4000-90","2x TLM 140W RS",70,null,11200,70000,"On-Off",""]
[542005006400,"LEDTrunking Module L15-70W-4000-60","2x TLM 140W RS",70,null,11200,70000,"On-Off",""]
[542005006500,"LEDTrunking Module L15-70W-4000-BW","2x TLM 140W RS",70,null,11200,70000,"On-Off",""]
[542005006600,"LEDTrunking Module L15-50W-4000-120-DALI","TL 2x80W",50,null,8000,70000,"DALI2",""]
[542005006700,"LEDTrunking Module L15-50W-4000-90-DALI","TL 2x80W",50,null,8000,70000,"DALI2",""]
[542005006800,"LEDTrunking Module L15-50W-4000-60-DALI","TL 2x80W",50,null,8000,70000,"DALI2",""]
[542005006900,"LEDTrunking Module L15-50W-4000-BW-DALI","TL 2x80W",50,null,8000,70000,"DALI2",""]
[542005007000,"LEDTrunking Module L15-70W-4000-120-DALI","2x TLM 140W RS",70,null,11200,70000,"DALI2",""]
[542005007100,"LEDTrunking Module L15-70W-4000-90-DALI","2x TLM 140W RS",70,null,11200,70000,"DALI2",""]
[542005007200,"LEDTrunking Module L15-70W-4000-60-DALI","2x TLM 140W RS",70,null,11200,70000,"DALI2",""]
[542005007300,"LEDTrunking Module L15-70W-4000-BW-DALI","2x TLM 140W RS",70,null,11200,70000,"DALI2",""]
[542005008200,"LEDTrunking Module L15-35W-4000-120","TL 2x58W",35,null,5600,70000,"On-Off",""]
[542005008600,"LEDTrunking Module L15-35W-4000-120-DALI","TL 2x58W",35,null,5600,70000,"DALI2",""]
[542005039700,"LEDLinear-E CL12-40W-3000-WH","TL 2x36W",40,null,4320,70000,"On-Off",""]
[542005039800,"LEDLinear-E CL12-40W-4000-WH","TL 2x36W",40,null,4720,70000,"On-Off",""]
[542005039900,"LEDLinear-E CL15-53W-3000-WH","TL 2x58W",53,null,5930,70000,"On-Off",{"$f":"IF(OR(H706=$L$5,H706=$L$6,H706=$L$9),\"Smart\",\"\")","v":""}]
[542005040000,"LEDLinear-E CL15-53W-4000-WH","TL 2x58W",53,null,6360,70000,"On-Off",""]
[542006000900,"LEDPanelSp-Z L1222-75W-BLE-4000-AL","TL 2x58W",75,null,7875,60000,"BLE","Smart"]
[542006001000,"LEDPanelSp-Z L1222-75W-BLE-3000-AL","TL 2x58W",75,null,7875,60000,"BLE","Smart"]
[542008000900,"LEDPanelRc-Sy Sq595-35W-3000-WH-U19","TL 4x18W",35,null,3600,70000,"On-Off",""]
[542008001000,"LEDPanelRc-Sy Sq595-35W-4000-WH-U19","TL 4x18W",35,null,3800,70000,"On-Off",""]
[542008001100,"LEDPanelRc-Sy Re295-35W-3000-WH-U19","TL 2x36W",35,null,3600,70000,"On-Off",""]
[542008001200,"LEDPanelRc-Sy Re295-35W-4000-WH-U19","TL 2x36W",35,null,3800,70000,"On-Off",""]
[542008001300,"LEDPanelRc-Sy Sq595-35W-DALI-3000-WH-U19","TL 4x18W",35,null,3600,70000,"DALI2",""]
[542008001400,"LEDPanelRc-Sy Sq595-35W-DALI-4000-WH-U19","TL 4x18W",35,null,3800,70000,"DALI2",""]
[542008001500,"LEDPanelRc-Sy Re295-35W-DALI-3000-WH-U19","TL 2x36W",35,null,3600,70000,"DALI2",""]
[542008001600,"LEDPanelRc-Sy Re295-35W-DALI-4000-WH-U19","TL 2x36W",35,null,3800,70000,"DALI2",""]
[542008001700,"LEDPanelRc-Sy Sq595-35W-10V-3000-WH-U19","TL 4x18W",35,null,3600,70000,"1-10V",""]
[542008001800,"LEDPanelRc-Sy Sq595-35W-10V-4000-WH-U19","TL 4x18W",35,null,3800,70000,"1-10V",""]
[542008001900,"LEDPanelRc-Sy Re295-35W-10V-3000-WH-U19","TL 2x36W",35,null,3600,70000,"1-10V",""]
[542008002000,"LEDPanelRc-Sy Re295-35W-10V-4000-WH-U19","TL 2x36W",35,null,3800,70000,"1-10V",""]
[542008002100,"LEDPanelRc-Sy Sq595-35W-BLE-3000-WH-U19","TL 4x18W",35,null,3600,70000,"BLE","Smart"]
[542008002200,"LEDPanelRc-Sy Sq595-35W-BLE-4000-WH-U19","TL 4x18W",35,null,3800,70000,"BLE","Smart"]
[542008002300,"LEDPanelRc-Sy Re295-35W-BLE-3000-WH-U19","TL 2x36W",35,null,3600,70000,"BLE","Smart"]
[542008002400,"LEDPanelRc-Sy Re295-35W-BLE-4000-WH-U19","TL 2x36W",35,null,3800,70000,"BLE","Smart"]
[542008007900,"LEDPanelRc-G Sq598-33W-BLE-3000-WH-CT","TL 4x18W",33,null,4200,70000,"BLE","Smart"]
[542008008000,"LEDPanelRc-G Sq598-33W-BLE-4000-WH-CT","TL 4x18W",33,null,4300,70000,"BLE","Smart"]
[542008008100,"LEDPanelRc-G Re298-33W-BLE-3000-WH-CT","TL 2x36W",33,null,4200,70000,"BLE","Smart"]
[542008008200,"LEDPanelRc-G Re298-33W-BLE-4000-WH-CT","TL 2x36W",33,null,4300,70000,"BLE","Smart"]
[543006000600,"LEDFlood-E2 Re113-10W-4000-BL","Halogen 50W",10,null,1050,50000,"On-Off",""]
[543006000700,"LEDFlood-E2 Re127-19W-3000-BL","Halogen 100W",19,null,1900,50000,"On-Off",""]
[543006000800,"LEDFlood-E2 Re127-19W-4000-BL","Halogen 100W",19,null,1900,50000,"On-Off",""]
[543006000900,"LEDFlood-E2 Re113-10W-4000-WH","Halogen 50W",10,null,1050,50000,"On-Off",""]
[543006001000,"LEDFlood-E2 Re127-19W-3000-WH","Halogen 100W",19,null,1900,50000,"On-Off",""]
[543006001100,"LEDFlood-E2 Re127-19W-4000-WH","Halogen 100W",19,null,1900,50000,"On-Off",""]
[543011000300,"LEDWall-Mounted-P Rd300-22W-MD","CFL 2x26W",22,null,2550,50000,"1-10V",""]
[543011000400,"LEDWall-Mounted-P Rd300-21W","CFL 2x26W",21,null,2550,50000,"1-10V",""]
[543011000500,"LEDWall-Mounted-P Rd300-16W-MD","CFL 2x18W",16,null,1750,50000,"1-10V",""]
[543011000600,"LEDWall-Mounted-P Rd300-15W","CFL 2x18W",15,null,1750,50000,"1-10V",""]
[543011003200,"LEDWall-Mounted-P Rd300-15W-EM3","CFL 2x18W",15,null,1750,50000,"1-10V",""]
[543011003300,"LEDWall-Mounted-P Rd300-16W-MD-EM3","CFL 2x18W",16,null,1750,50000,"1-10V",""]
[543011003400,"LEDWall-Mounted-P Rd300-21W-EM3","CFL 2x26W",21,null,2550,50000,"1-10V",""]
[543011003500,"LEDWall-Mounted-P Rd300-22W-MD-EM3","CFL 2x26W",22,null,2550,50000,"1-10V",""]
[543011003600,"LEDWall-Mounted-P Rd300-15W-EM1","CFL 2x18W",15,null,1750,50000,"1-10V",""]
[543011003700,"LEDWall-Mounted-P Rd300-16W-MD-EM1","CFL 2x18W",16,null,1750,50000,"1-10V",""]
[543011003800,"LEDWall-Mounted-P Rd300-21W-EM1","CFL 2x26W",21,null,2550,50000,"1-10V",""]
[543011003900,"LEDWall-Mounted-P Rd300-22W-MD-EM1","CFL 2x26W",22,null,2550,50000,"1-10V",""]
[543012002500,"LEDBollard-P L600-10.5W-3000-W","CFL 1x32W",10.5,null,900,50000,"On-Off",""]
[543012002600,"LEDBollard-P L900-10.5W-3000-W","CFL 1x32W",10.5,null,900,50000,"On-Off",""]
[543012002900,"LEDBollard-P L600-10.5W-4000-W","CFL 1x32W",10.5,null,1000,50000,"On-Off",""]
[543012003000,"LEDBollard-P L900-10.5W-4000-W","CFL 1x32W",10.5,null,1000,50000,"On-Off",""]
[543014005500,"LEDRoadlight-200W-4000-DALI","HID 250W",200,null,24000,100000,"DALI",""]
[543014005600,"LEDRoadlight-150W-4000-DALI","HID 250W",150,null,18750,100000,"DALI",""]
[543014005700,"LEDRoadlight-120W-4000-DALI","HID 150W",120,null,15000,100000,"DALI",""]
[543014005800,"LEDRoadlight-90W-4000-DALI","HID 150W",90,null,11250,100000,"DALI",""]
[543014015600,"LEDRoadlight-150W-4000-STEP","HID 250W",150,null,18750,100000,"STEP",""]
[543014015700,"LEDRoadlight-90W-4000-STEP","HID 150W",90,null,11250,100000,"STEP",""]
[543014015800,"LEDRoadlight-200W-4000-STEP","HID 250W",200,null,24000,100000,"STEP",""]
[543014015900,"LEDRoadlight-120W-4000-STEP","HID 150W",120,null,15000,100000,"STEP",""]
[543016005700,"LEDPostTop-P 33W-3000-AS","HID 50W",33,null,4000,100000,"On-Off",""]
[543016005800,"LEDPostTop-P 50W-3000-AS","HID 70W",50,null,6000,100000,"On-Off",""]
[543016005900,"LEDPostTop-P 68W-3000-AS","HID 100W",68,null,8200,100000,"On-Off",""]
[543016006000,"LEDPostTop-P 33W-3000-W","HID 50W",33,null,4300,100000,"On-Off",""]
[543016006100,"LEDPostTop-P 50W-3000-W","HID 70W",50,null,6500,100000,"On-Off",""]
[543016006200,"LEDPostTop-P 68W-3000-W","HID 100W",68,null,8800,100000,"On-Off",""]
[543016006300,"LEDPostTop-P 33W-4000-AS","HID 50W",33,null,4100,100000,"On-Off",""]
[543016006400,"LEDPostTop-P 50W-4000-AS","HID 70W",50,null,6300,100000,"On-Off",""]
[543016006500,"LEDPostTop-P 68W-4000-AS","HID 100W",68,null,8500,100000,"On-Off",""]
[543016006600,"LEDPostTop-P 33W-4000-W","HID 50W",33,null,4500,100000,"On-Off",""]
[543016006700,"LEDPostTop-P 50W-4000-W","HID 70W",50,null,6800,100000,"On-Off",{"$f":"IF(OR(H770=$L$5,H770=$L$6,H770=$L$9),\"Smart\",\"\")","v":""}]
[543016006800,"LEDPostTop-P 68W-4000-W","HID 100W",68,null,9200,100000,"On-Off",""]
[543017011600,"LEDFlood-E2 Re283-70W-4000-BL","HID 150W",70,null,8400,50000,"On-Off",""]
[543017011700,"LEDFlood-E2 Re253-50W-4000-BL","HID 70W",50,null,6000,50000,"On-Off",""]
[543017011800,"LEDFlood-E2 Re199-30W-4000-BL","HID 50W",30,null,3600,50000,"On-Off",""]
[543017012000,"LEDFlood-E2 Re253-50W-3000-BL","HID 70W",50,null,5500,50000,"On-Off",""]
[543017012100,"LEDFlood-E2 Re199-30W-3000-BL","HID 50W",30,null,3300,50000,"On-Off",""]
[543017012500,"LEDFloodHO-P-620W-5700-XN","HID 1000W",620,null,80000,100000,"1-10V",""]
[543017012600,"LEDFloodHO-P-620W-5700-N","HID 1000W",620,null,80000,100000,"1-10V",""]
[543017012700,"LEDFloodHO-P-620W-5700-W","HID 1000W",620,null,80000,100000,"1-10V",""]
[543017013100,"LEDFloodHO-P-310W-5700-XN","HID 500W",310,null,40000,100000,"1-10V",""]
[543017013200,"LEDFloodHO-P-310W-5700-N","HID 500W",310,null,40000,100000,"1-10V",""]
[543017013300,"LEDFloodHO-P-310W-5700-W","HID 500W",310,null,40000,100000,"1-10V",""]
[543017020400,"LEDFlood-E2 Re113-10W-3000-BL","Halogen 50W",10,null,1050,50000,"On-Off",""]
[543017020500,"LEDFlood-E2 Re113-10W-3000-WH","Halogen 50W",10,null,1050,50000,"On-Off",""]
[543017026100,"LEDFlood-P Re440-220W-4000-W-BL","HID 500W",220,null,32000,70000,"On-Off",""]
[543017026200,"LEDFlood-P Re440-220W-4000-AS-BL","HID 500W",220,null,32000,70000,"On-Off",""]
[543017026300,"LEDFlood-P Re440-220W-5700-W-BL","HID 500W",220,null,32000,70000,"On-Off",""]
[543017026400,"LEDFlood-P Re440-220W-5700-AS-BL","HID 500W",220,null,32000,70000,"On-Off",""]
[543017041100,"LEDFlood-P Re440-220W-4000-N-BL","HID 500W",220,null,32000,70000,"On-Off",""]
[543017041200,"LEDFlood-P Re440-220W-5700-N-BL","HID 500W",220,null,32000,70000,"On-Off",""]
[543017043300,"LEDFloodHO-P-310W-4000-W","HID 500W",310,null,40000,100000,"1-10V",""]
[543017045000,"LEDFloodHO-P-620W-4000-W","HID 1000W",620,null,80000,100000,"1-10V",""]
[543017045100,"LEDFloodHO-P-620W-4000-N","HID 1000W",620,null,80000,100000,"1-10V",""]
[543017045300,"LEDFloodHO-P-620W-4000-XN","HID 1000W",620,null,80000,100000,"1-10V",""]
[543017045400,"LEDFloodHO-P-310W-4000-XN","HID 500W",310,null,40000,100000,"1-10V",""]
[543017045600,"LEDFloodHO-P-310W-4000-N","HID 500W",310,null,40000,100000,"1-10V",""]
[543022006400,"LEDWaterproof-B L1150-36W-4000","TL 2x36W",36,null,4500,30000,"On-Off",""]
[543022006500,"LEDWaterproof-B L1450-50W-4000","TL 2x58W",50,null,6250,30000,"On-Off",""]
[543022011900,"LEDWaterproof-E2 L1540-50W-6500","TL 2x58W",50,null,6500,50000,"On-Off",""]
[543022012000,"LEDWaterproof-E2 L1540-50W-4000","TL 2x58W",50,null,6500,50000,"On-Off",""]
[543022012100,"LEDWaterproof-E2 L1540-27W-4000","TL 1x58W",27,null,3510,50000,"On-Off",""]
[543022012200,"LEDWaterproof-E2 L1260-37W-6500","TL 2x36W",37,null,4810,50000,"On-Off",""]
[543022012300,"LEDWaterproof-E2 L1260-37W-4000","TL 2x36W",37,null,4810,50000,"On-Off",""]
[543022012400,"LEDWaterproof-E2 L1260-18W-4000","TL 1x36W",18,null,2340,50000,"On-Off",""]
[543022012500,"LEDWaterproof-E2 L680-20W-4000","TL 2x18W",20,null,2600,50000,"On-Off",""]
[543022012600,"LEDWaterproof-E2 L680-10W-4000","TL 1x18W",10,null,1300,50000,"On-Off",""]
[543022015500,"LEDWaterproof-P3 L710-12.5W-4000","TL 1x18W",12.5,null,1700,70000,"On-Off",""]
[543022015600,"LEDWaterproof-P3 L710-24W-4000","TL 2x18W",24,null,3240,70000,"On-Off",""]
[543022015700,"LEDWaterproof-P3 L1310-38W-4000","TL 2x36W",38,null,5320,70000,"On-Off",""]
[543022015800,"LEDWaterproof-P3 L1310-24W-4000","TL 1x36W",24,null,3360,70000,"On-Off",""]
[543022015900,"LEDWaterproof-P3 L1310-38W-6500","TL 2x36W",38,null,5320,70000,"On-Off",""]
[543022016000,"LEDWaterproof-P3 L1610-31W-4000","TL 1x58W",31,null,4340,70000,"On-Off",""]
[543022016100,"LEDWaterproof-P3 L1610-47W-4000","TL 2x58W",47,null,6580,70000,"On-Off",""]
[543022016200,"LEDWaterproof-P3 L1610-54W-4000","TL 2x58W",54,null,7560,70000,"On-Off",""]
[543022016300,"LEDWaterproof-P3 L1310-38W-4000-PLUS","TL 2x36W",38,null,5320,70000,"On-Off",""]
[543022016400,"LEDWaterproof-P3 L1610-31W-4000-PLUS","TL 1x58W",31,null,4340,70000,"On-Off",""]
[543022016500,"LEDWaterproof-P3 L1610-54W-4000-PLUS","TL 2x58W",54,null,7560,70000,"On-Off",""]
[543022016600,"LEDWaterproof-P3 L1610-54W-6500","TL 2x58W",54,null,7560,70000,"On-Off",""]
[543022017500,"LEDWaterproof-B L1150-36W-4000-WT","TL 2x36W",36,null,4500,30000,"On-Off",""]
[543022017600,"LEDWaterproof-B L1450-50W-4000-WT","TL 2x58W",50,null,6250,30000,"On-Off",""]
[543022017700,"LEDWaterproof-B L1150-36W-6500-WT","TL 2x36W",36,null,4500,30000,"On-Off",""]
[543022017800,"LEDWaterproof-B L1450-50W-6500-WT","TL 2x58W",50,null,6250,30000,"On-Off",""]
[543022017900,"LEDWaterproof-B L1150-36W-6500","TL 2x36W",36,null,4500,30000,"On-Off",""]
[543022018000,"LEDWaterproof-B L1450-50W-6500","TL 2x58W",50,null,6250,30000,"On-Off",""]
[543022018200,"LEDWaterproof-P3 L710-22W-4000-DALI","TL 2x18W",22,null,3000,70000,"DALI",""]
[543022018500,"LEDWaterproof-P3 L1310-36W-4000-DALI","TL 2x36W",36,null,5040,70000,"DALI",""]
[543022018600,"LEDWaterproof-P3 L1610-31W-4000-DALI","TL 1x58W",31,null,4340,70000,"DALI",""]
[543022018800,"LEDWaterproof-P3 L1610-51W-4000-DALI","TL 2x58W",51,null,7140,70000,"DALI",""]
[543022018900,"LEDWaterproof-P3 L1610-51W-6500-DALI","TL 2x58W",51,null,7140,70000,"DALI",""]
[543022019300,"LEDWaterproof-P3 L1310-36W-4000-BLE","TL 2x36W",36,null,5040,70000,"BLE","Smart"]
[543022019600,"LEDWaterproof-P3 L1610-51W-4000-BLE","TL 2x58W",51,null,7140,70000,"BLE","Smart"]
[543022019800,"LEDWaterproof-P3 L710-22W-4000-BLE","TL 2x18W",22,null,3000,70000,"BLE","Smart"]
[543022021100,"LEDWaterproof SE-P L1250-24W-840-IP69K","TL 1x36W",24,null,3240,70000,"On-Off",""]
[543022021200,"LEDWaterproof SE-P L1250-45W-840-IP69K","TL 2x36W",45,null,6075,70000,"On-Off",{"$f":"IF(OR(H834=$L$5,H834=$L$6,H834=$L$9),\"Smart\",\"\")","v":""}]
[543022021300,"LEDWaterproof SE-P L1550-34W-840-IP69K","TL 1x58W",34,null,4590,70000,"On-Off",""]
[543022021400,"LEDWaterproof SE-P L1550-54W-840-IP69K","TL 2x58W",54,null,7290,70000,"On-Off",""]
[543022021600,"LEDWaterproof-P3 L710-12.5W-4000-EM1","TL 1x18W",12.5,null,1700,70000,"On-Off",""]
[543022021800,"LEDWaterproof-P3 L710-24W-4000-EM1","TL 2x18W",24,null,3240,70000,"On-Off",""]
[543022022000,"LEDWaterproof-P3 L1310-24W-4000-EM1","TL 1x36W",24,null,3360,70000,"On-Off",""]
[543022022100,"LEDWaterproof-P3 L1310-24W-4000-EM3","TL 1x36W",24,null,3360,70000,"On-Off",""]
[543022022200,"LEDWaterproof-P3 L1310-38W-4000-EM1","TL 2x36W",38,null,5320,70000,"On-Off",""]
[543022022300,"LEDWaterproof-P3 L1310-38W-4000-PLUS-EM3","TL 2x36W",38,null,5320,70000,"On-Off",""]
[543022022400,"LEDWaterproof-P3 L1310-38W-6500-EM1","TL 2x36W",38,null,5320,70000,"On-Off",""]
[543022022500,"LEDWaterproof-P3 L1310-38W-6500-EM3","TL 2x36W",38,null,5320,70000,"On-Off",""]
[543022022600,"LEDWaterproof-P3 L1310-38W-4000-EM3","TL 2x36W",38,null,5320,70000,"On-Off",""]
[543022022700,"LEDWaterproof-P3 L1610-31W-4000-EM1","TL 1x58W",31,null,4340,70000,"On-Off",""]
[543022022800,"LEDWaterproof-P3 L1610-31W-4000-EM3","TL 1x58W",31,null,4340,70000,"On-Off",""]
[543022022900,"LEDWaterproof-P3 L1610-47W-4000-EM1","TL 2x58W",47,null,6580,70000,"On-Off",""]
[543022023000,"LEDWaterproof-P3 L1610-47W-4000-EM3","TL 2x58W",47,null,6580,70000,"On-Off",""]
[543022023100,"LEDWaterproof-P3 L1610-54W-4000-EM1","TL 2x58W",54,null,7560,70000,"On-Off",""]
[543022023200,"LEDWaterproof-P3 L1610-54W-4000-EM3","TL 2x58W",54,null,7560,70000,"On-Off",""]
[543022023300,"LEDWaterproof-P3 L1610-54W-6500-EM1","TL 2x58W",54,null,7560,70000,"On-Off",""]
[543022023400,"LEDWaterproof-P3 L1610-54W-6500-EM3","TL 2x58W",54,null,7560,70000,"On-Off",""]
[543022023500,"LEDWaterproof-P3 L1310-38W-4000-PLUS-EM1","TL 2x36W",38,null,5320,70000,"On-Off",""]
[543022023600,"LEDWaterproof-P3 L1610-31W-4000-PLUS-EM1","TL 1x58W",31,null,4340,70000,"On-Off",""]
[543022023700,"LEDWaterproof-P3 L1610-31W-4000-PLUS-EM3","TL 1x58W",31,null,4340,70000,"On-Off",""]
[543022023800,"LEDWaterproof-P3 L1610-54W-4000-PLUS-EM1","TL 2x58W",54,null,7560,70000,"On-Off",""]
[543022023900,"LEDWaterproof-P3 L1610-54W-4000-PLUS-EM3","TL 2x58W",54,null,7560,70000,"On-Off",""]
[543022024100,"LEDWaterproof-P3 L1610-75W-4000","TL 2x80W",75,null,9750,70000,"On-Off",""]
[543022024200,"LEDWaterproof-P3 L1610-90W-4000","2x TLM 140W RS",90,null,12150,70000,"On-Off",""]
[545001000900,"LEDHighbay-P4 220W-4000-100D","HID 600W",220,null,32000,70000,"On-Off",""]
[545001001000,"LEDHighbay-P4 220W-4000-60D","HID 600W",220,null,32000,70000,"On-Off",""]
[545001001100,"LEDHighbay-P4 155W-4000-60D","HID 400W",155,null,22000,70000,"On-Off",""]
[545001001200,"LEDHighbay-P4 155W-4000-100D","HID 400W",155,null,22000,70000,"On-Off",""]
[545001001300,"LEDHighbay-P4 155W-DALI-4000-60D","HID 400W",155,null,22000,70000,"DALI",""]
[545001001400,"LEDHighbay-P4 155W-DALI-4000-100D","HID 400W",155,null,22000,70000,"DALI",""]
[545001001500,"LEDHighbay-P4 220W-DALI-4000-60D","HID 600W",220,null,32000,70000,"DALI",""]
[545001001600,"LEDHighbay-P4 220W-DALI-4000-100D","HID 600W",220,null,32000,70000,"DALI",""]
[545001002500,"LEDHighbay-P4 80W-4000-50D","HID 250W",80,null,11600,70000,"On-Off",""]
[545001002600,"LEDHighbay-P4 80W-4000-95D","HID 250W",80,null,11600,70000,"On-Off",""]
[545001002700,"LEDHighbay-P4 80W-4000-50x95D","HID 250W",80,null,11600,70000,"On-Off",""]
[545001002800,"LEDHighbay-P4 80W-DALI-4000-50D","HID 250W",80,null,11600,70000,"DALI",""]
[545001002900,"LEDHighbay-P4 80W-DALI-4000-95D","HID 250W",80,null,11600,70000,"DALI",""]
[545001003000,"LEDHighbay-P4 80W-DALI-4000-50x95D","HID 250W",80,null,11600,70000,"DALI",""]
[545001003100,"LEDHighbay-P4 110W-4000-50D","HID 400W",110,null,16000,70000,"On-Off",""]
[545001003200,"LEDHighbay-P4 110W-4000-95D","HID 400W",110,null,16000,70000,"On-Off",""]
[545001003300,"LEDHighbay-P4 110W-4000-50x95D","HID 400W",110,null,16000,70000,"On-Off",""]
[545001003400,"LEDHighbay-P4 110W-DALI-4000-50D","HID 400W",110,null,16000,70000,"DALI",""]
[545001003500,"LEDHighbay-P4 110W-DALI-4000-95D","HID 400W",110,null,16000,70000,"DALI",""]
[545001003600,"LEDHighbay-P4 110W-DALI-4000-50x95D","HID 400W",110,null,16000,70000,"DALI",""]
[545001003700,"LEDHighbay-P4 155W-4000-60x100D","HID 400W",155,null,22000,70000,"On-Off",""]
[545001003800,"LEDHighbay-P4 155W-DALI-4000-60x100D","HID 400W",155,null,22000,70000,"DALI",""]
[545001003900,"LEDHighbay-P4 220W-4000-60x100D","HID 600W",220,null,32000,70000,"On-Off",""]
[545001004000,"LEDHighbay-P4 220W-DALI-4000-60x100D","HID 600W",220,null,32000,70000,"DALI",""]
[545001008700,"LEDHighbay-P4 220W-4000-AS-BLE","HID 600W",220,null,32000,70000,"BLE","Smart"]
[545001008800,"LEDHighbay-P4 220W-4000-W-BLE","HID 600W",220,null,32000,70000,"BLE","Smart"]
[545001008900,"LEDHighbay-P4 220W-4000-N-BLE","HID 600W",220,null,32000,70000,"BLE","Smart"]
[545001009000,"LEDHighbay-P4 155W-4000-AS-BLE","HID 400W",155,null,22000,70000,"BLE","Smart"]
[545001009100,"LEDHighbay-P4 155W-4000-W-BLE","HID 400W",155,null,22000,70000,"BLE","Smart"]
[545001009200,"LEDHighbay-P4 155W-4000-N-BLE","HID 400W",155,null,22000,70000,"BLE","Smart"]
[545001009300,"LEDHighbay-P4 110W-4000-AS-BLE","HID 400W",110,null,16000,70000,"BLE","Smart"]
[545001009400,"LEDHighbay-P4 110W-4000-W-BLE","HID 400W",110,null,16000,70000,"BLE","Smart"]
[545001009500,"LEDHighbay-P4 110W-4000-N-BLE","HID 400W",110,null,16000,70000,"BLE","Smart"]
[545001009600,"LEDHighbay-P4 80W-4000-AS-BLE","HID 250W",80,null,11600,70000,"BLE","Smart"]
[545001009700,"LEDHighbay-P4 80W-4000-N-BLE","HID 250W",80,null,11600,70000,"BLE","Smart"]
[545001009800,"LEDHighbay-P4 80W-4000-W-BLE","HID 250W",80,null,11600,70000,"BLE","Smart"]
[545001010100,"LEDHighbay-P4 80W-4000-N-MD","HID 250W",80,null,11600,70000,"Sensor controlled (MD)",""]
[545001010200,"LEDHighbay-P4 110W-4000-W-MD","HID 400W",110,null,16000,70000,"Sensor controlled (MD)",{"$f":"IF(OR(H898=$L$5,H898=$L$6,H898=$L$9),\"Smart\",\"\")","v":""}]
[545001010300,"LEDHighbay-P4 80W-4000-W-MD","HID 250W",80,null,11600,70000,"Sensor controlled (MD)",""]
[545001010400,"LEDHighbay-P4 80W-4000-AS-MD","HID 250W",80,null,11600,70000,"Sensor controlled (MD)",""]
[545001010500,"LEDHighbay-P4 110W-4000-N-MD","HID 400W",110,null,16000,70000,"Sensor controlled (MD)",""]
[545001010600,"LEDHighbay-P4 110W-4000-AS-MD","HID 400W",110,null,16000,70000,"Sensor controlled (MD)",""]
[545001010700,"LEDHighbay-P4 155W-4000-N-MD","HID 400W",155,null,22000,70000,"Sensor controlled (MD)",""]
[545001010800,"LEDHighbay-P4 155W-4000-AS-MD","HID 400W",155,null,22000,70000,"Sensor controlled (MD)",""]
[545001011500,"LEDHighbay-P4 155W-4000-W-MD","HID 400W",155,null,22000,70000,"Sensor controlled (MD)",""]
[545001012300,"LEDHighbay-P4 220W-5700-100D","HID 600W",220,null,32000,70000,"On-Off",""]
[545001012400,"LEDHighbay-P4 155W-5700-100D","HID 400W",155,null,22000,70000,"On-Off",""]
[545001014600,"LEDHighbay-P4 80W-5700-50D","HID 250W",80,null,11600,70000,"On-Off",""]
[545001014700,"LEDHighbay-P4 80W-5700-95D","HID 250W",80,null,11600,70000,"On-Off",""]
[545001014800,"LEDHighbay-P4 80W-5700-50x95D","HID 250W",80,null,11600,70000,"On-Off",""]
[545001014900,"LEDHighbay-P4 110W-5700-50D","HID 400W",110,null,16000,70000,"On-Off",""]
[545001015000,"LEDHighbay-P4 110W-5700-95D","HID 400W",110,null,16000,70000,"On-Off",""]
[545001015100,"LEDHighbay-P4 110W-5700-50x95D","HID 400W",110,null,16000,70000,"On-Off",""]
[545001015200,"LEDHighbay-P4 155W-5700-60D","HID 400W",155,null,22000,70000,"On-Off",""]
[545001015300,"LEDHighbay-P4 155W-5700-60x100D","HID 400W",155,null,22000,70000,"On-Off",""]
[545001015400,"LEDHighbay-P4 220W-5700-60D","HID 600W",220,null,32000,70000,"On-Off",""]
[545001015500,"LEDHighbay-P4 220W-5700-60x100D","HID 600W",220,null,32000,70000,"On-Off",""]
[545001015600,"LEDHighbay-P4 80W-DALI-5700-50D","HID 250W",80,null,11600,70000,"DALI",""]
[545001015700,"LEDHighbay-P4 80W-DALI-5700-95D","HID 250W",80,null,11600,70000,"DALI",""]
[545001015800,"LEDHighbay-P4 80W-DALI-5700-50x95D","HID 250W",80,null,11600,70000,"DALI",""]
[545001015900,"LEDHighbay-P4 110W-DALI-5700-50D","HID 400W",110,null,16000,70000,"DALI",""]
[545001016000,"LEDHighbay-P4 110W-DALI-5700-95D","HID 400W",110,null,16000,70000,"DALI",""]
[545001016100,"LEDHighbay-P4 110W-DALI-5700-50x95D","HID 400W",110,null,16000,70000,"DALI",""]
[545001016200,"LEDHighbay-P4 155W-DALI-5700-60D","HID 400W",155,null,22000,70000,"DALI",""]
[545001016300,"LEDHighbay-P4 155W-DALI-5700-100D","HID 400W",155,null,22000,70000,"DALI",""]
[545001016400,"LEDHighbay-P4 155W-DALI-5700-60x100D","HID 400W",155,null,22000,70000,"DALI",""]
[545001016500,"LEDHighbay-P4 220W-DALI-5700-60D","HID 600W",220,null,32000,70000,"DALI",""]
[545001016600,"LEDHighbay-P4 220W-DALI-5700-100D","HID 600W",220,null,32000,70000,"DALI",""]
[545001016700,"LEDHighbay-P4 220W-DALI-5700-60x100D","HID 600W",220,null,32000,70000,"DALI",""]
[545001024300,"LEDHighbay-P4 80W-5700-N-BLE","HID 250W",80,null,11600,70000,"BLE","Smart"]
[545001024400,"LEDHighbay-P4 80W-5700-W-BLE","HID 250W",80,null,11600,70000,"BLE","Smart"]
[545001024500,"LEDHighbay-P4 80W-5700-AS-BLE","HID 250W",80,null,11600,70000,"BLE","Smart"]
[545001024600,"LEDHighbay-P4 110W-5700-N-BLE","HID 400W",110,null,16000,70000,"BLE","Smart"]
[545001024700,"LEDHighbay-P4 110W-5700-W-BLE","HID 400W",110,null,16000,70000,"BLE","Smart"]
[545001024800,"LEDHighbay-P4 110W-5700-AS-BLE","HID 400W",110,null,16000,70000,"BLE","Smart"]
[545001024900,"LEDHighbay-P4 155W-5700-N-BLE","HID 400W",155,null,22000,70000,"BLE","Smart"]
[545001025000,"LEDHighbay-P4 155W-5700-W-BLE","HID 400W",155,null,22000,70000,"BLE","Smart"]
[545001025100,"LEDHighbay-P4 155W-5700-AS-BLE","HID 400W",155,null,22000,70000,"BLE","Smart"]
[545001025200,"LEDHighbay-P4 220W-5700-N-BLE","HID 600W",220,null,32000,70000,"BLE","Smart"]
[545001025300,"LEDHighbay-P4 220W-5700-W-BLE","HID 600W",220,null,32000,70000,"BLE","Smart"]
[545001025400,"LEDHighbay-P4 220W-5700-AS-BLE","HID 600W",220,null,32000,70000,"BLE","Smart"]
[545001047200,"LEDHighbay-E2 80W-840-W","HID 250W",80,null,10400,50000,"On-Off",""]
[545001047400,"LEDHighbay-E2 80W-857-W","HID 250W",80,null,10400,50000,"On-Off",""]
[545001047600,"LEDHighbay-E2 120W-840-W","HID 400W",120,null,15600,50000,"On-Off",""]
[545001047800,"LEDHighbay-E2 120W-857-W","HID 400W",120,null,15600,50000,"On-Off",""]
[545001048000,"LEDHighbay-E2 150W-840-W","HID 400W",150,null,19500,50000,"On-Off",""]
[545001048200,"LEDHighbay-E2 150W-857-W","HID 400W",150,null,19500,50000,"On-Off",""]
[545001048300,"LEDHighbay-E2 200W-840-N","HID 400W HO",200,null,26000,50000,"On-Off",""]
[545001048400,"LEDHighbay-E2 200W-840-W","HID 400W HO",200,null,26000,50000,"On-Off",""]
[545001048600,"LEDHighbay-E2 200W-857-W","HID 400W HO",200,null,26000,50000,"On-Off",""]
[545001048700,"LEDHighbay-E2 240W-840-N","HID 600W",240,null,31200,50000,"On-Off",""]
[545001048800,"LEDHighbay-E2 240W-840-W","HID 600W",240,null,31200,50000,"On-Off",""]
[545001049000,"LEDHighbay-E2 240W-857-W","HID 600W",240,null,31200,50000,"On-Off",""]
[545001059600,"LEDHighbay-P5 80W-DALI+BLE2-840-N","HID 250W",80,null,12800,100000,"DALI2+BLE2","Smart"]
[545001059700,"LEDHighbay-P5 80W-DALI+BLE2-840-W","HID 250W",80,null,12800,100000,"DALI2+BLE2","Smart"]
[545001059800,"LEDHighbay-P5 80W-DALI+BLE2-840-AS","HID 250W",80,null,12800,100000,"DALI2+BLE2","Smart"]
[545001060200,"LEDHighbay-P5 110W-DALI+BLE2-840-N","HID 400W",110,null,17600,100000,"DALI2+BLE2","Smart"]
[545001060300,"LEDHighbay-P5 110W-DALI+BLE2-840-W","HID 400W",110,null,17600,100000,"DALI2+BLE2","Smart"]
[545001060400,"LEDHighbay-P5 110W-DALI+BLE2-840-AS","HID 400W",110,null,17600,100000,"DALI2+BLE2","Smart"]
[545001060800,"LEDHighbay-P5 150W-DALI+BLE2-840-N","HID 400W",150,null,24000,100000,"DALI2+BLE2","Smart"]
[545001060900,"LEDHighbay-P5 150W-DALI+BLE2-840-W","HID 400W",150,null,24000,100000,"DALI2+BLE2","Smart"]
[545001061000,"LEDHighbay-P5 150W-DALI+BLE2-840-AS","HID 400W",150,null,24000,100000,"DALI2+BLE2",{"$f":"IF(OR(H962=$L$5,H962=$L$6,H962=$L$9),\"Smart\",\"\")","v":"Smart"}]
[545001061100,"LEDHighbay-P5 150W-DALI+BLE2-857-N","HID 400W",150,null,24000,100000,"DALI2+BLE2","Smart"]
[545001061200,"LEDHighbay-P5 150W-DALI+BLE2-857-W","HID 400W",150,null,24000,100000,"DALI2+BLE2","Smart"]
[545001061300,"LEDHighbay-P5 150W-DALI+BLE2-857-AS","HID 400W",150,null,24000,100000,"DALI2+BLE2","Smart"]
[545001061400,"LEDHighbay-P5 200W-DALI+BLE2-840-N","HID 600W",200,null,32000,100000,"DALI2+BLE2","Smart"]
[545001061500,"LEDHighbay-P5 200W-DALI+BLE2-840-W","HID 600W",200,null,32000,100000,"DALI2+BLE2","Smart"]
[545001061600,"LEDHighbay-P5 200W-DALI+BLE2-840-AS","HID 600W",200,null,32000,100000,"DALI2+BLE2","Smart"]
[545001062000,"LEDHighbay-P5 240W-840-N","HID 600W",240,null,38400,100000,"On-Off",""]
[545001062100,"LEDHighbay-P5 240W-840-W","HID 600W",240,null,38400,100000,"On-Off",""]
[545001062200,"LEDHighbay-P5 240W-840-AS","HID 600W",240,null,38400,100000,"On-Off",""]
[545001062300,"LEDHighbay-P5 240W-857-N","HID 600W",240,null,38400,100000,"On-Off",""]
[545001062400,"LEDHighbay-P5 240W-857-W","HID 600W",240,null,38400,100000,"On-Off",""]
[545001062500,"LEDHighbay-P5 240W-857-AS","HID 600W",240,null,38400,100000,"On-Off",""]
[545001062600,"LEDHighbay-P5 240W-DALI+BLE2-840-N","HID 600W",240,null,38400,100000,"DALI2+BLE2","Smart"]
[545001062700,"LEDHighbay-P5 240W-DALI+BLE2-840-W","HID 600W",240,null,38400,100000,"DALI2+BLE2","Smart"]
[545001062800,"LEDHighbay-P5 240W-DALI+BLE2-840-AS","HID 600W",240,null,38400,100000,"DALI2+BLE2","Smart"]
[545001067600,"LEDHighbay-P5 200W-840-W","HID 600W",200,null,32000,100000,"On-Off",""]
[545001067700,"LEDHighbay-P5 200W-840-N","HID 600W",200,null,32000,100000,"On-Off",""]
[545001067800,"LEDHighbay-P5 200W-840-AS","HID 600W",200,null,32000,100000,"On-Off",""]
[545001067900,"LEDHighbay-P5 150W-840-N","HID 400W",150,null,24000,100000,"On-Off",""]
[545001068000,"LEDHighbay-P5 150W-840-W","HID 400W",150,null,24000,100000,"On-Off",""]
[545001068100,"LEDHighbay-P5 150W-840-AS","HID 400W",150,null,24000,100000,"On-Off",""]
[545001068200,"LEDHighbay-P5 80W-840-N","HID 250W",80,null,12800,100000,"On-Off",""]
[545001068300,"LEDHighbay-P5 80W-840-W","HID 250W",80,null,12800,100000,"On-Off",""]
[545001068400,"LEDHighbay-P5 80W-840-AS","HID 250W",80,null,12800,100000,"On-Off",""]
[545001068500,"LEDHighbay-P5 110W-840-N","HID 400W",110,null,17600,100000,"On-Off",""]
[545001068600,"LEDHighbay-P5 110W-840-W","HID 400W",110,null,17600,100000,"On-Off",""]
[545001068700,"LEDHighbay-P5 110W-840-AS","HID 400W",110,null,17600,100000,"On-Off",""]
[545001068800,"LEDHighbay-P5 200W-857-W","HID 600W",200,null,32000,100000,"On-Off",""]
[545001068900,"LEDHighbay-P5 200W-857-N","HID 600W",200,null,32000,100000,"On-Off",""]
[545001069000,"LEDHighbay-P5 200W-857-AS","HID 600W",200,null,32000,100000,"On-Off",""]
[545001069100,"LEDHighbay-P5 150W-857-N","HID 400W",150,null,24000,100000,"On-Off",""]
[545001069200,"LEDHighbay-P5 150W-857-W","HID 400W",150,null,24000,100000,"On-Off",""]
[545001069300,"LEDHighbay-P5 150W-857-AS","HID 400W",150,null,24000,100000,"On-Off",""]
[545001069400,"LEDHighbay-P5 80W-857-N","HID 250W",80,null,12800,100000,"On-Off",""]
[545001069500,"LEDHighbay-P5 80W-857-W","HID 250W",80,null,12800,100000,"On-Off",""]
[545001069600,"LEDHighbay-P5 80W-857-AS","HID 250W",80,null,12800,100000,"On-Off",""]
[545001069700,"LEDHighbay-P5 110W-857-N","HID 400W",110,null,17600,100000,"On-Off",""]
[545001069800,"LEDHighbay-P5 110W-857-W","HID 400W",110,null,17600,100000,"On-Off",""]
[545001069900,"LEDHighbay-P5 110W-857-AS","HID 400W",110,null,17600,100000,"On-Off",""]
[545002000100,"LEDLowbay-E 80W-4000-90D","HID 100W",80,null,8000,60000,"On-Off",""]
[545002000200,"LEDLowbay-E 80W-4000-60D","HID 100W",80,null,7200,60000,"On-Off",""]
[545002000300,"LEDLowbay-E 50W-4000-120D","HID 70W",50,null,5000,60000,"On-Off",""]
[545002000400,"LEDLowbay-E 50W-4000-60D","HID 70W",50,null,5000,60000,"On-Off",""]
[545002000500,"LEDLowbay-E 30W-4000-120D","CFL 2x26W",30,null,3000,60000,"On-Off",""]
[545002000600,"LEDLowbay-E 30W-4000-60D","CFL 2x26W",30,null,3000,60000,"On-Off",""]
[549003003800,"LEDLinear-E CL12-40W-3000-WH-EM1","TL 2x36W",40,null,4320,70000,"On-Off",""]
[549003003900,"LEDLinear-E CL12-40W-4000-WH-EM1","TL 2x36W",40,null,4720,70000,"On-Off",""]
[549003004000,"LEDLinear-E CL15-53W-3000-WH-EM1","TL 2x58W",53,null,5930,70000,"On-Off",""]
[549003004100,"LEDLinear-E CL15-53W-4000-WH-EM1","TL 2x58W",53,null,6360,70000,"On-Off",""]
[549003004200,"LEDLinear-E CL12-40W-3000-WH-EM3","TL 2x36W",40,null,4320,70000,"On-Off",""]
[549003004300,"LEDLinear-E CL12-40W-4000-WH-EM3","TL 2x36W",40,null,4720,70000,"On-Off",""]
[549003004400,"LEDLinear-E CL15-53W-3000-WH-EM3","TL 2x58W",53,null,5930,70000,"On-Off",""]
[549003004500,"LEDLinear-E CL15-53W-4000-WH-EM3","TL 2x58W",53,null,6360,70000,"On-Off",""]
[549004002400,"LEDLima L12-15W-3000-U19-DALI-EM1","TL 1x28W",15,null,1725,70000,"DALI",""]
[549004002500,"LEDLima L12-15W-4000-U19-DALI-EM1","TL 1x28W",15,null,1800,70000,"DALI",""]
[549004002600,"LEDLima L15-18W-3000-U19-DALI-EM1","TL 1x35W",18,null,2070,70000,"DALI",""]
[549004002700,"LEDLima L15-18W-4000-U19-DALI-EM1","TL 1x35W",18,null,2160,70000,"DALI",""]
[549004002800,"LEDLima L12-30W-3000-DALI-EM1","TL 1x54W",30,null,3300,70000,"DALI",""]
[549004002900,"LEDLima L12-30W-4000-DALI-EM1","TL 1x54W",30,null,3450,70000,"DALI",""]
[549004003000,"LEDLima L15-36W-3000-DALI-EM1","TL 1x80W",36,null,3960,70000,"DALI",""]
[549004003100,"LEDLima L15-36W-4000-DALI-EM1","TL 1x80W",36,null,4140,70000,"DALI",""]
[549004003200,"LEDLima L12-15W-3000-U19-DALI-EM3","TL 1x28W",15,null,1725,70000,"DALI",""]
[549004003300,"LEDLima L12-15W-4000-U19-DALI-EM3","TL 1x28W",15,null,1800,70000,"DALI",""]
[549004003400,"LEDLima L15-18W-3000-U19-DALI-EM3","TL 1x35W",18,null,2070,70000,"DALI",{"$f":"IF(OR(H1026=$L$5,H1026=$L$6,H1026=$L$9),\"Smart\",\"\")","v":""}]
[549004003500,"LEDLima L15-18W-4000-U19-DALI-EM3","TL 1x35W",18,null,2160,70000,"DALI",""]
[549004003600,"LEDLima L12-30W-3000-DALI-EM3","TL 1x54W",30,null,3300,70000,"DALI",""]
[549004003700,"LEDLima L12-30W-4000-DALI-EM3","TL 1x54W",30,null,3450,70000,"DALI",""]
[549004003800,"LEDLima L15-36W-3000-DALI-EM3","TL 1x80W",36,null,3960,70000,"DALI",""]
[549004003900,"LEDLima L15-36W-4000-DALI-EM3","TL 1x80W",36,null,4140,70000,"DALI",""]
[549004004010,"LEDTrunk Mod L15-70W-4000-BW-EM3","2x TLM 140W RS",70,null,11200,70000,"On-Off",""]
[549004004110,"LEDTrunk Mod L15-50W-4000-BW-EM1","TL 2x80W",50,null,8000,70000,"On-Off",""]
[549004004210,"LEDTrunk Mod L15-50W-4000-BW-DALI-EM1","TL 2x80W",50,null,8000,70000,"DALI2",""]
[549004004310,"LEDPorch-E Re120-5W-4000K-EM1","TL 8W",5,null,500,50000,"On-Off",""]
[549004004410,"LEDPorch-E Re120-5W-3000K-EM1","TL 8W",5,null,450,50000,"On-Off",""]
[549004004510,"LEDTrunk Mod L15-35W-4000-120-DALI-EM3","TL 2x58W",35,null,5600,70000,"DALI2",""]
[549004004610,"LEDTrunk Mod L15-35W-4000-120-EM3","TL 2x58W",35,null,5600,70000,"On-Off",""]
[549004004710,"LEDTrunk Mod L15-70W-4000-BW-DALI-EM3","2x TLM 140W RS",70,null,11200,70000,"DALI2",""]
[549004004810,"LEDTrunk Mod L15-70W-4000-60-EM3","2x TLM 140W RS",70,null,11200,70000,"On-Off",""]
[549004004910,"LEDTrunk Mod L15-70W-4000-60-DALI-EM3","2x TLM 140W RS",70,null,11200,70000,"DALI2",""]
[549004005010,"LEDTrunk Mod L15-70W-4000-90-DALI-EM3","2x TLM 140W RS",70,null,11200,70000,"DALI2",""]
[549004005110,"LEDTrunk Mod L15-70W-4000-120-DALI-EM3","2x TLM 140W RS",70,null,11200,70000,"DALI2",""]
[549004005210,"LEDTrunk Mod L15-50W-4000-BW-DALI-EM3","TL 2x80W",50,null,8000,70000,"DALI2",""]
[549004005310,"LEDTrunk Mod L15-50W-4000-60-DALI-EM3","TL 2x80W",50,null,8000,70000,"DALI2",""]
[549004005410,"LEDTrunk Mod L15-50W-4000-90-DALI-EM3","TL 2x80W",50,null,8000,70000,"DALI2",""]
[549004005510,"LEDTrunk Mod L15-50W-4000-120-EM1","TL 2x80W",50,null,8000,70000,"On-Off",""]
[549004005610,"LEDTrunk Mod L15-50W-4000-60-DALI-EM1","TL 2x80W",50,null,8000,70000,"DALI2",""]
[549004005710,"LEDTrunk Mod L15-50W-4000-90-EM3","TL 2x80W",50,null,8000,70000,"On-Off",""]
[549004005810,"LEDTrunk Mod L15-50W-4000-BW-EM3","TL 2x80W",50,null,8000,70000,"On-Off",""]
[549004005910,"LEDTrunk Mod L15-50W-4000-60-EM3","TL 2x80W",50,null,8000,70000,"On-Off",""]
[549004006010,"LEDTrunk Mod L15-70W-4000-120-EM3","2x TLM 140W RS",70,null,11200,70000,"On-Off",""]
[549004006110,"LEDTrunk Mod L15-70W-4000-BW-DALI-EM1","2x TLM 140W RS",70,null,11200,70000,"DALI2",""]
[549004006210,"LEDTrunk Mod L15-70W-4000-90-DALI-EM1","2x TLM 140W RS",70,null,11200,70000,"DALI2",""]
[549004006310,"LEDTrunk Mod L15-50W-4000-90-DALI-EM1","TL 2x80W",50,null,8000,70000,"DALI2",""]
[549004006410,"LEDTrunk Mod L15-70W-4000-60-DALI-EM1","2x TLM 140W RS",70,null,11200,70000,"DALI2",""]
[549004006510,"LEDTrunk Mod L15-70W-4000-120-DALI-EM1","2x TLM 140W RS",70,null,11200,70000,"DALI2",""]
[549004006610,"LEDTrunk Mod L15-50W-4000-120-DALI-EM3","TL 2x80W",50,null,8000,70000,"DALI2",""]
[549004006710,"LEDTrunk Mod L15-70W-4000-90-EM3","2x TLM 140W RS",70,null,11200,70000,"On-Off",""]
[549004006810,"LEDTrunk Mod L15-50W-4000-120-EM3","TL 2x80W",50,null,8000,70000,"On-Off",""]
[549004006910,"LEDTrunk Mod L15-35W-4000-120-DALI-EM1","TL 2x58W",35,null,5600,70000,"DALI2",""]
[549004007010,"LEDTrunk Mod L15-35W-4000-120-EM1","TL 2x58W",35,null,5600,70000,"On-Off",""]
[549004007110,"LEDTrunk Mod L15-50W-4000-120-DALI-EM1","TL 2x80W",50,null,8000,70000,"DALI2",""]
[549004007210,"LEDTrunk Mod L15-50W-4000-60-EM1","TL 2x80W",50,null,8000,70000,"On-Off",""]
[549004007310,"LEDTrunk Mod L15-70W-4000-120-EM1","2x TLM 140W RS",70,null,11200,70000,"On-Off",""]
[549004007410,"LEDTrunk Mod L15-70W-4000-60-EM1","2x TLM 140W RS",70,null,11200,70000,"On-Off",""]
[549004007510,"LEDTrunk Mod L15-70W-4000-90-EM1","2x TLM 140W RS",70,null,11200,70000,"On-Off",""]
[549004007610,"LEDTrunk Mod L15-50W-4000-90-EM1","TL 2x80W",50,null,8000,70000,"On-Off",""]
[549004008010,"LEDTrunk Mod L15-70W-4000-BW-EM1","2x TLM 140W RS",70,null,11200,70000,"On-Off",""]
[549004008210,"LEDPorch-E Re120-6W-4000K-MD-EM1","TL 8W",6,null,510,50000,"Sensor controlled (MD)",""]
[549004008310,"LEDPorch-E Re120-6W-3000K-MD-EM1","TL 8W",6,null,480,50000,"Sensor controlled (MD)",""]
[549004010000,"LEDLinear-E CL06-20W-3000-WH-EM1","TL 2x18W",20,null,2100,70000,"On-Off",""]
[549004010100,"LEDLinear-E CL06-20W-4000-WH-EM1","TL 2x18W",20,null,2300,70000,"On-Off",""]
[549004010200,"LEDLinear-E CL06-20W-3000-WH-EM3","TL 2x18W",20,null,2100,70000,"On-Off",""]
[549004010300,"LEDLinear-E CL06-20W-4000-WH-EM3","TL 2x18W",20,null,2300,70000,"On-Off",""]
[549004010400,"LEDTrunk Mod L15-35W-4000-DF-DALI-EM1-DZ","TL 2x58W",35,null,5250,70000,"DALI2",""]
[549004010500,"LEDTrunk Mod L15-35W-4000-DF-DALI-EM3-DZ","TL 2x58W",35,null,5250,70000,"DALI2",""]
[549013000900,"LEDWaterproof-CLA-E L650-20W-4000-EM1","TL 2x18W",20,null,2500,50000,"On-Off",""]
[549013001000,"LEDWaterproof-CLA-E L1250-20W-4000-EM1","TL 1x36W",20,null,2500,50000,"On-Off",""]
[549013001100,"LEDWaterproof-CLA-E L1250-43W-4000-EM1","TL 2x36W",43,null,5375,50000,"On-Off",""]
[549013001200,"LEDWaterproof-CLA-E L1550-29W-4000-EM1","TL 1x58W",29,null,3625,50000,"On-Off",""]
[549013001300,"LEDWaterproof-CLA-E L1550-53W-4000-EM1","TL 2x58W",53,null,6625,50000,"On-Off",""]
[549013001400,"LEDWaterproof-CLA-E L650-20W-4000-EM3","TL 2x18W",20,null,2500,50000,"On-Off",""]
[549013001500,"LEDWaterproof-CLA-E L1250-20W-4000-EM3","TL 1x36W",20,null,2500,50000,"On-Off",""]
[549013001600,"LEDWaterproof-CLA-E L1250-43W-4000-EM3","TL 2x36W",43,null,5375,50000,"On-Off",""]
[549013001700,"LEDWaterproof-CLA-E L1550-29W-4000-EM3","TL 1x58W",29,null,3625,50000,"On-Off",""]
[549013001800,"LEDWaterproof-CLA-E L1550-53W-4000-EM3","TL 2x58W",53,null,6625,50000,"On-Off",""]
[599000032700,"Light-master-III",null,null,null,null,null,null,""]
[703000003100,"LEDBollard-Luke-E L500-8W-830-BL","Halogen 60W",8,null,600,50000,"On-Off",""]
[703000003200,"LEDBollard-Luke-E L500-8W-840-BL","Halogen 60W",8,null,650,50000,"On-Off",{"$f":"IF(OR(H1090=$L$5,H1090=$L$6,H1090=$L$9),\"Smart\",\"\")","v":""}]
[703000003300,"LEDBollard-Luke-E L1000-8W-830-BL","Halogen 60W",8,null,600,50000,"On-Off",""]
[703000003400,"LEDBollard-Luke-E L1000-8W-840-BL","Halogen 60W",8,null,650,50000,"On-Off",""]
[705000021000,"LEDStreetlight-E2 20W-3000","HID 50W",20,null,2300,70000,"On-Off",""]
[705000021100,"LEDStreetlight-E2 40W-3000","HID 70W",40,null,4700,70000,"On-Off",""]
[705000021200,"LEDStreetlight-E2 60W-3000","HID 100W",60,null,7100,70000,"On-Off",""]
[705000021300,"LEDRoadlight-E 80W-3000","HID 150W",80,null,9500,70000,"On-Off",""]
[705000021400,"LEDRoadlight-E 100W-3000","HID 150W",100,null,11600,70000,"On-Off",""]
[705000021500,"LEDStreetlight-E2 20W-4000","HID 50W",20,null,2500,70000,"On-Off",""]
[705000021600,"LEDStreetlight-E2 40W-4000","HID 70W",40,null,5000,70000,"On-Off",""]
[705000021700,"LEDStreetlight-E2 60W-4000","HID 100W",60,null,7500,70000,"On-Off",""]
[705000021800,"LEDRoadlight-E 80W-4000","HID 150W",80,null,10000,70000,"On-Off",""]
[705000021900,"LEDRoadlight-E 100W-4000","HID 150W",100,null,12500,70000,"On-Off",""]
[705000022000,"LEDStreetlight-E2 20W-4000-DD","HID 50W",20,null,2500,70000,"On-Off",""]
[705000022100,"LEDStreetlight-E2 40W-4000-DD","HID 70W",40,null,5000,70000,"On-Off",""]
[705000022200,"LEDStreetlight-E2 60W-4000-DD","HID 100W",60,null,7500,70000,"On-Off",""]
[705000066600,"LEDRoad-St-P2 Re588-120W-740","HID 150W",120,null,18000,100000,"On-Off",""]
[705000066700,"LEDRoad-St-P2 Re489-80W-DALI-730-ZH","HID 150W",80,null,12000,100000,"DALI2",""]
[705000066800,"LEDRoad-St-P2 Re489-80W-730","HID 150W",80,null,12000,100000,"On-Off",""]
[705000066900,"LEDRoad-St-P2 Re489-60W-DALI-730-ZH","HID 100W",60,null,9000,100000,"DALI2",""]
[705000067000,"LEDRoad-St-P2 Re489-60W-DALI-740","HID 100W",60,null,9000,100000,"DALI2",""]
[705000067100,"LEDRoad-St-P2 Re588-150W-DALI-730-ZH","HID 250W",150,null,22500,100000,"DALI2",""]
[705000067200,"LEDRoad-St-P2 Re588-150W-DALI-730","HID 250W",150,null,22500,100000,"DALI2",""]
[705000067300,"LEDRoad-St-P2 Re489-80W-DALI-740","HID 150W",80,null,12000,100000,"DALI2",""]
[705000067400,"LEDRoad-St-P2 Re489-60W-730","HID 100W",60,null,9000,100000,"On-Off",""]
[705000067500,"LEDRoad-St-P2 Re489-60W-DALI-740-ZH","HID 100W",60,null,9000,100000,"DALI2",""]
[705000067600,"LEDRoad-St-P2 Re588-150W-DALI-740","HID 250W",150,null,22500,100000,"DALI2",""]
[705000067700,"LEDRoad-St-P2 Re588-150W-730","HID 250W",150,null,22500,100000,"On-Off",""]
[705000067800,"LEDRoad-St-P2 Re588-120W-DALI-730","HID 150W",120,null,18000,100000,"DALI2",""]
[705000067900,"LEDRoad-St-P2 Re489-80W-DALI-730","HID 150W",80,null,12000,100000,"DALI2",""]
[705000068000,"LEDRoad-St-P2 Re489-80W-740","HID 150W",80,null,12000,100000,"On-Off",""]
[705000068100,"LEDRoad-St-P2 Re588-150W-740","HID 250W",150,null,22500,100000,"On-Off",""]
[705000068200,"LEDRoad-St-P2 Re588-120W-730","HID 150W",120,null,18000,100000,"On-Off",""]
[705000068300,"LEDRoad-St-P2 Re588-120W-DALI-740","HID 150W",120,null,18000,100000,"DALI2",""]
[705000068400,"LEDRoad-St-P2 Re588-120W-DALI-740-ZH","HID 150W",120,null,18000,100000,"DALI2",""]
[705000068500,"LEDRoad-St-P2 Re588-120W-DALI-730-ZH","HID 150W",120,null,18000,100000,"DALI2",""]
[705000068600,"LEDRoad-St-P2 Re489-60W-DALI-730","HID 100W",60,null,9000,100000,"DALI2",""]
[705000068700,"LEDRoad-St-P2 Re489-80W-DALI-740-ZH","HID 150W",80,null,12000,100000,"DALI2",""]
[705000068800,"LEDRoad-St-P2 Re489-60W-740","HID 100W",60,null,9000,100000,"On-Off",""]
[705000068900,"LEDRoad-St-P2 Re588-150W-DALI-740-ZH","HID 250W",150,null,22500,100000,"DALI2",""]
[705000095800,"LEDRoad-St-P2 Re488-20W-730","HID 50W",20,null,3000,100000,"On-Off",""]
[705000095900,"LEDRoad-St-P2 Re488-20W-740","HID 50W",20,null,3000,100000,"On-Off",""]
[705000096000,"LEDRoad-St-P2 Re488-20W-DALI-730","HID 50W",20,null,3000,100000,"DALI2",""]
[705000096100,"LEDRoad-St-P2 Re488-20W-DALI-740","HID 50W",20,null,3000,100000,"DALI2",""]
[705000096200,"LEDRoad-St-P2 Re488-20W-DALI-730-ZH","HID 50W",20,null,3000,100000,"DALI2",""]
[705000096300,"LEDRoad-St-P2 Re488-20W-DALI-740-ZH","HID 50W",20,null,3000,100000,"DALI2",""]
[705000096400,"LEDRoad-St-P2 Re488-40W-730","HID 70W",40,null,6000,100000,"On-Off",""]
[705000096500,"LEDRoad-St-P2 Re488-40W-740","HID 70W",40,null,6000,100000,"On-Off",""]
[705000096600,"LEDRoad-St-P2 Re488-40W-DALI-730","HID 70W",40,null,6000,100000,"DALI2",""]
[705000096700,"LEDRoad-St-P2 Re488-40W-DALI-740","HID 70W",40,null,6000,100000,"DALI2",""]
[705000096800,"LEDRoad-St-P2 Re488-40W-DALI-730-ZH","HID 70W",40,null,6000,100000,"DALI2",""]
[705000096900,"LEDRoad-St-P2 Re488-40W-DALI-740-ZH","HID 70W",40,null,6000,100000,"DALI2",""]
[705000097900,"LEDRoad-St-P2 Re488-40W-730-XAS","HID 70W",40,null,6000,100000,"On-Off",""]
[705000098000,"LEDRoad-St-P2 Re488-40W-740-XAS","HID 70W",40,null,6000,100000,"On-Off",""]
[705000098100,"LEDRoad-St-P2 Re488-40W-DALI-730-XAS","HID 70W",40,null,6000,100000,"DALI2",""]
[705000098200,"LEDRoad-St-P2 Re488-40W-DALI-740-XAS","HID 70W",40,null,6000,100000,"DALI2",""]
[705000098300,"LEDRoad-St-P2 Re488-40W-DALI-730-XAS-ZH","HID 70W",40,null,6000,100000,"DALI2",""]
[705000098400,"LEDRoad-St-P2 Re488-40W-DALI-740-XAS-ZH","HID 70W",40,null,6000,100000,"DALI2",""]
[705000098500,"LEDRoad-St-P2 Re488-20W-DALI-740-XAS-ZH","HID 50W",20,null,3000,100000,"DALI2",""]
[705000098600,"LEDRoad-St-P2 Re488-20W-DALI-730-XAS-ZH","HID 50W",20,null,3000,100000,"DALI2",""]
[705000098700,"LEDRoad-St-P2 Re488-20W-DALI-740-XAS","HID 50W",20,null,3000,100000,"DALI2",""]
[705000098800,"LEDRoad-St-P2 Re488-20W-DALI-730-XAS","HID 50W",20,null,3000,100000,"DALI2",""]
[705000098900,"LEDRoad-St-P2 Re488-20W-730-XAS","HID 50W",20,null,3000,100000,"On-Off",""]
[705000099000,"LEDRoad-St-P2 Re488-20W-740-XAS","HID 50W",20,null,3000,100000,"On-Off",""]
[708000000100,"LEDPostTop-P 33W-3000-AS-D76","HID 50W",33,null,4000,100000,"On-Off",{"$f":"IF(OR(H1154=$L$5,H1154=$L$6,H1154=$L$9),\"Smart\",\"\")","v":""}]
[708000000200,"LEDPostTop-P 50W-3000-AS-D76","HID 70W",50,null,6000,100000,"On-Off",""]
[708000000300,"LEDPostTop-P 68W-3000-AS-D76","HID 100W",68,null,8200,100000,"On-Off",""]
[708000000400,"LEDPostTop-P 33W-3000-W-D76","HID 50W",33,null,4300,100000,"On-Off",""]
[708000000500,"LEDPostTop-P 50W-3000-W-D76","HID 70W",50,null,6500,100000,"On-Off",""]
[708000000600,"LEDPostTop-P 68W-3000-W-D76","HID 100W",68,null,8800,100000,"On-Off",""]
[708000000700,"LEDPostTop-P 33W-4000-AS-D76","HID 50W",33,null,4100,100000,"On-Off",""]
[708000000800,"LEDPostTop-P 50W-4000-AS-D76","HID 70W",50,null,6300,100000,"On-Off",""]
[708000000900,"LEDPostTop-P 68W-4000-AS-D76","HID 100W",68,null,8500,100000,"On-Off",""]
[708000001000,"LEDPostTop-P 33W-4000-W-D76","HID 50W",33,null,4500,100000,"On-Off",""]
[708000001100,"LEDPostTop-P 50W-4000-W-D76","HID 70W",50,null,6800,100000,"On-Off",""]
[708000001200,"LEDPostTop-P 68W-4000-W-D76","HID 100W",68,null,9200,100000,"On-Off",""]
[708000003800,"LEDPostTop-P 33W-DALI-730-AS-D76","HID 50W",33,null,4000,100000,"DALI2",""]
[708000003900,"LEDPostTop-P 33W-DALI-730-W","HID 50W",33,null,4300,100000,"DALI2",""]
[708000004000,"LEDPostTop-P 33W-DALI-730-W-D76","HID 50W",33,null,4300,100000,"DALI2",""]
[708000004100,"LEDPostTop-P 33W-DALI-740-AS-D76","HID 50W",33,null,4100,100000,"DALI2",""]
[708000004200,"LEDPostTop-P 33W-DALI-740-W","HID 50W",33,null,4500,100000,"DALI2",""]
[708000004300,"LEDPostTop-P 33W-DALI-740-W-D76","HID 50W",33,null,4500,100000,"DALI2",""]
[708000004400,"LEDPostTop-P 50W-DALI-730-AS","HID 70W",50,null,6000,100000,"DALI2",""]
[708000004500,"LEDPostTop-P 50W-DALI-730-AS-D76","HID 70W",50,null,6000,100000,"DALI2",""]
[708000004600,"LEDPostTop-P 50W-DALI-730-W","HID 70W",50,null,6500,100000,"DALI2",""]
[708000004700,"LEDPostTop-P 50W-DALI-730-W-D76","HID 70W",50,null,6500,100000,"DALI2",""]
[708000004800,"LEDPostTop-P 50W-DALI-740-AS","HID 70W",50,null,6300,100000,"DALI2",""]
[708000004900,"LEDPostTop-P 50W-DALI-740-AS-D76","HID 70W",50,null,6300,100000,"DALI2",""]
[708000005000,"LEDPostTop-P 50W-DALI-740-W","HID 70W",50,null,6800,100000,"DALI2",""]
[708000005100,"LEDPostTop-P 50W-DALI-740-W-D76","HID 70W",50,null,6800,100000,"DALI2",""]
[708000005200,"LEDPostTop-P 33W-DALI-740-AS","HID 50W",33,null,4100,100000,"DALI2",""]
[708000005300,"LEDPostTop-P 33W-DALI-730-AS","HID 50W",33,null,4000,100000,"DALI2",""]
[709000027000,"LEDSpotProjector-E Rd82-8W-830-36D","Halogen 50W",8,null,600,50000,"On-Off",""]
[709000027200,"LEDSpotProjector-E Rd82-8W-840-36D","Halogen 50W",8,null,600,50000,"On-Off",""]
[709000027400,"LEDSpotProjector-E Rd127-15W-830-36D","Halogen 75W",15,null,1200,50000,"On-Off",""]
[709000027600,"LEDSpotProjector-E Rd127-15W-840-36D","Halogen 75W",15,null,1200,50000,"On-Off",""]
[709000056900,"LEDFloodMo-P Re340-70W-840-AS","HID 150W",70,null,9800,100000,"On-Off",""]
[709000057500,"LEDFloodMo-P Re340-100W-840-AS","HID 250W",100,null,14000,100000,"On-Off",""]
[709000058100,"LEDFloodMo-P Re450-150W-840-AS","HID 400W",150,null,21000,100000,"On-Off",""]
[709000058500,"LEDFloodMo-P Re450-200W-840-N","HID 400W",200,null,28000,100000,"On-Off",""]
[709000058700,"LEDFloodMo-P Re450-200W-840-AS","HID 400W",200,null,28000,100000,"On-Off",""]
[709000058800,"LEDFloodMo-P Re450-200W-857-N","HID 400W",200,null,28000,100000,"On-Off",""]
[709000059000,"LEDFloodMo-P Re450-200W-857-AS","HID 400W",200,null,28000,100000,"On-Off",""]
[709000059100,"LEDFloodMo-P Re570-250W-840-N","HID 2x250W",250,null,35000,100000,"On-Off",""]
[709000059300,"LEDFloodMo-P Re570-250W-840-AS","HID 2x250W",250,null,35000,100000,"On-Off",""]
[709000059400,"LEDFloodMo-P Re570-250W-857-N","HID 2x250W",250,null,35000,100000,"On-Off",""]
[709000059600,"LEDFloodMo-P Re570-250W-857-AS","HID 2x250W",250,null,35000,100000,"On-Off",""]
[709000059700,"LEDFloodMo-P Re570-300W-840-N","HID 2x400W",300,null,42000,100000,"On-Off",""]
[709000059900,"LEDFloodMo-P Re570-300W-840-AS","HID 2x400W",300,null,42000,100000,"On-Off",""]
[709000060000,"LEDFloodMo-P Re570-300W-857-N","HID 2x400W",300,null,42000,100000,"On-Off",""]
[709000060200,"LEDFloodMo-P Re570-300W-857-AS","HID 2x400W",300,null,42000,100000,"On-Off",""]
[709000071500,"LEDFlood-E3 Re100-10W-830-BL","Halogen 50W",10,null,1100,50000,"On-Off",""]
[709000071600,"LEDFlood-E3 Re115-20W-830-BL","Halogen 100W",20,null,2200,50000,"On-Off",""]
[709000071700,"LEDFlood-E3 Re100-10W-840-BL","Halogen 50W",10,null,1200,50000,"On-Off",""]
[709000071800,"LEDFlood-E3 Re115-20W-840-BL","Halogen 100W",20,null,2400,50000,"On-Off",""]
[709000071900,"LEDFlood-E3 Re100-10W-830-WH","Halogen 50W",10,null,1100,50000,"On-Off",""]
[709000072000,"LEDFlood-E3 Re115-20W-830-WH","Halogen 100W",20,null,2200,50000,"On-Off",""]
[709000072100,"LEDFlood-E3 Re100-10W-840-WH","Halogen 50W",10,null,1200,50000,"On-Off",""]
[709000072200,"LEDFlood-E3 Re115-20W-840-WH","Halogen 100W",20,null,2400,50000,"On-Off",""]
[709000072300,"LEDFlood-E3 Re144-10W-830-BL-MD","Halogen 50W",10,null,1100,50000,"Sensor controlled (MD)",""]
[709000072400,"LEDFlood-E3 Re144-20W-830-BL-MD","Halogen 100W",20,null,2200,50000,"Sensor controlled (MD)",""]
[709000072500,"LEDFlood-E3 Re144-10W-840-BL-MD","Halogen 50W",10,null,1200,50000,"Sensor controlled (MD)",""]
[709000072600,"LEDFlood-E3 Re144-20W-840-BL-MD","Halogen 100W",20,null,2400,50000,"Sensor controlled (MD)",""]
[709000072700,"LEDFlood-E3 Re144-30W-830-BL","HID 50W",30,null,3600,50000,"On-Off",""]
[709000072800,"LEDFlood-E3 Re144-30W-840-BL","HID 50W",30,null,3900,50000,"On-Off",""]
[709000072900,"LEDFlood-E3 Re170-50W-830-BL","HID 70W",50,null,6000,50000,"On-Off",""]
[709000073000,"LEDFlood-E3 Re170-50W-840-BL","HID 70W",50,null,6500,50000,"On-Off",""]
[709000073100,"LEDFlood-E3 Re246-70W-830-BL","HID 150W",70,null,8400,50000,"On-Off",""]
[709000073200,"LEDFlood-E3 Re246-70W-840-BL","HID 150W",70,null,9100,50000,"On-Off",{"$f":"IF(OR(H1218=$L$5,H1218=$L$6,H1218=$L$9),\"Smart\",\"\")","v":""}]
[709000073300,"LEDFlood-E3 Re246-100W-830-BL","HID 250W",100,null,12000,50000,"On-Off",""]
[709000073400,"LEDFlood-E3 Re246-100W-840-BL","HID 250W",100,null,13000,50000,"On-Off",""]
[709000073500,"LEDFlood-E3 Re300-150W-830-BL","HID 400W",150,null,18000,50000,"On-Off",""]
[709000073600,"LEDFlood-E3 Re300-150W-840-BL","HID 400W",150,null,19500,50000,"On-Off",""]
[709000073700,"LEDFlood-E3 Re345-200W-830-BL","HID 400W",200,null,24000,50000,"On-Off",""]
[709000073800,"LEDFlood-E3 Re345-200W-840-BL","HID 400W",200,null,26000,50000,"On-Off",""]
[709000078300,"LEDFloodMo-P Re570-380W-840-N","HID 500W",380,null,53200,100000,"On-Off",""]
[709000078500,"LEDFloodMo-P Re570-380W-840-AS","HID 500W",380,null,53200,100000,"On-Off",""]
[709000078600,"LEDFloodMo-P Re570-380W-857-N","HID 500W",380,null,53200,100000,"On-Off",""]
[709000078800,"LEDFloodMo-P Re570-380W-857-AS","HID 500W",380,null,53200,100000,"On-Off",""]
[709000082600,"LEDFloodOly-P Re600-600W-740-AS-LUM","HID 1000W",600,null,90000,100000,"DALI2",""]
[709000082700,"LEDFloodOly-P Re600-600W-757-AS-LUM","HID 1000W",600,null,90000,100000,"DALI2",""]
[709000082900,"LEDFloodOly-P Re600-600W-740-XN-LUM","HID 1000W",600,null,96000,100000,"DALI2",""]
[709000083000,"LEDFloodOly-P Re600-600W-757-XN-LUM","HID 1000W",600,null,96000,100000,"DALI2",""]
[709000083200,"LEDFloodOly-P Re600-600W-740-N-LUM","HID 1000W",600,null,96000,100000,"DALI2",""]
[709000083300,"LEDFloodOly-P Re600-600W-757-N-LUM","HID 1000W",600,null,96000,100000,"DALI2",""]
[709000083500,"LEDFloodOly-P Re600-600W-740-W-LUM","HID 1000W",600,null,96000,100000,"DALI2",""]
[709000083600,"LEDFloodOly-P Re600-600W-757-W-LUM","HID 1000W",600,null,96000,100000,"DALI2",""]
[709000083800,"LEDFloodOly-P Re600-800W-740-AS-LUM","HID 1000W",800,null,120000,100000,"DALI2",""]
[709000083900,"LEDFloodOly-P Re600-800W-757-AS-LUM","HID 1000W",800,null,120000,100000,"DALI2",""]
[709000084100,"LEDFloodOly-P Re600-800W-740-XN-LUM","HID 1000W",800,null,128000,100000,"DALI2",""]
[709000084200,"LEDFloodOly-P Re600-800W-757-XN-LUM","HID 1000W",800,null,128000,100000,"DALI2",""]
[709000084400,"LEDFloodOly-P Re600-800W-740-N-LUM","HID 1000W",800,null,128000,100000,"DALI2",""]
[709000084500,"LEDFloodOly-P Re600-800W-757-N-LUM","HID 1000W",800,null,128000,100000,"DALI2",""]
[709000084700,"LEDFloodOly-P Re600-800W-740-W-LUM","HID 1000W",800,null,128000,100000,"DALI2",""]
[709000084800,"LEDFloodOly-P Re600-800W-757-W-LUM","HID 1000W",800,null,128000,100000,"DALI2",""]
[709000085000,"LEDFloodOly-P Re700-1000W-740-AS-LUM","HID 2000W",1000,null,150000,100000,"DALI2",""]
[709000085100,"LEDFloodOly-P Re700-1000W-757-AS-LUM","HID 2000W",1000,null,150000,100000,"DALI2",""]
[709000085300,"LEDFloodOly-P Re700-1000W-740-XN-LUM","HID 2000W",1000,null,160000,100000,"DALI2",""]
[709000085400,"LEDFloodOly-P Re700-1000W-757-XN-LUM","HID 2000W",1000,null,160000,100000,"DALI2",""]
[709000085600,"LEDFloodOly-P Re700-1000W-740-N-LUM","HID 2000W",1000,null,160000,100000,"DALI2",""]
[709000085700,"LEDFloodOly-P Re700-1000W-757-N-LUM","HID 2000W",1000,null,160000,100000,"DALI2",""]
[709000085900,"LEDFloodOly-P Re700-1000W-740-W-LUM","HID 2000W",1000,null,160000,100000,"DALI2",""]
[709000086000,"LEDFloodOly-P Re700-1000W-757-W-LUM","HID 2000W",1000,null,160000,100000,"DALI2",""]
[709000086200,"LEDFloodOly-P Re700-1200W-740-AS-LUM","HID 2000W",1200,null,180000,100000,"DALI2",""]
[709000086300,"LEDFloodOly-P Re700-1200W-757-AS-LUM","HID 2000W",1200,null,180000,100000,"DALI2",""]
[709000086500,"LEDFloodOly-P Re700-1200W-740-XN-LUM","HID 2000W",1200,null,192000,100000,"DALI2",""]
[709000086600,"LEDFloodOly-P Re700-1200W-757-XN-LUM","HID 2000W",1200,null,192000,100000,"DALI2",""]
[709000086800,"LEDFloodOly-P Re700-1200W-740-N-LUM","HID 2000W",1200,null,192000,100000,"DALI2",""]
[709000086900,"LEDFloodOly-P Re700-1200W-757-N-LUM","HID 2000W",1200,null,192000,100000,"DALI2",""]
[709000087100,"LEDFloodOly-P Re700-1200W-740-W-LUM","HID 2000W",1200,null,192000,100000,"DALI2",""]
[709000087200,"LEDFloodOly-P Re700-1200W-757-W-LUM","HID 2000W",1200,null,192000,100000,"DALI2",""]
[711000004500,"LEDWaterproof-B2 L1200-36W-865","TL 2x36W",36,null,4680,50000,"On-Off",""]
[711000004600,"LEDWaterproof-B2 L1200-36W-840","TL 2x36W",36,null,4680,50000,"On-Off",""]
[711000004900,"LEDWaterproof-B2 L1500-50W-865","TL 2x58W",50,null,6500,50000,"On-Off",""]
[711000005000,"LEDWaterproof-B2 L1500-50W-840","TL 2x58W",50,null,6500,50000,"On-Off",""]
[711000005700,"LEDWaterproof-P4 L648-24W-DALI-840","TL 2x18W",24,null,3600,100000,"DALI2",""]
[711000005900,"LEDWaterproof-P4 L1489-31W-DALI-840","TL 1x58W",31,null,4650,100000,"DALI2",""]
[711000006100,"LEDWaterproof-P4 L1208-36W-DALI-840","TL 2x36W",36,null,5400,100000,"DALI2",""]
[711000006200,"LEDWaterproof-P4 L1489-51W-DALI-840","TL 2x58W",51,null,7650,100000,"DALI2",""]
[711000006600,"LEDWaterproof-P4 L1208-24W-BLE2-840","TL 2x18W",24,null,3600,100000,"BLE2","Smart"]
[711000006800,"LEDWaterproof-P4 L1208-36W-BLE2-840","TL 2x36W",36,null,5400,100000,"BLE2","Smart"]
[711000006900,"LEDWaterproof-P4 L1489-51W-BLE2-840","TL 2x58W",51,null,7650,100000,"BLE2","Smart"]
[711000007100,"LEDWaterproof-P4 L1489-31W-BLE2-840","TL 1x58W",31,null,4650,100000,"BLE2","Smart"]
[711000007200,"LEDWaterproof-P4 L1208-38W-840-PLUS","TL 2x36W",38,null,5700,100000,"On-Off",""]
[711000007300,"LEDWaterproof-P4 L1489-31W-840-PLUS","TL 1x58W",31,null,4650,100000,"On-Off",""]
[711000007400,"LEDWaterproof-P4 L1489-54W-840-PLUS","TL 2x58W",54,null,8100,100000,"On-Off",""]
[711000007500,"LEDWaterproof-P4 L648-12W-840","TL 1x18W",12,null,1800,100000,"On-Off",""]
[711000007600,"LEDWaterproof-P4 L648-24W-840","TL 2x18W",24,null,3600,100000,"On-Off",""]
[711000007700,"LEDWaterproof-P4 L1208-24W-840","TL 1x36W",24,null,3600,100000,"On-Off",""]
[711000007800,"LEDWaterproof-P4 L1208-38W-840","TL 2x36W",38,null,5700,100000,"On-Off",""]
[711000007900,"LEDWaterproof-P4 L1208-38W-865","TL 2x36W",38,null,5700,100000,"On-Off",""]
[711000008000,"LEDWaterproof-P4 L1489-31W-840","TL 1x58W",31,null,4650,100000,"On-Off",""]
[711000008100,"LEDWaterproof-P4 L1489-47W-840","TL 2x58W",47,null,7050,100000,"On-Off",{"$f":"IF(OR(H1282=$L$5,H1282=$L$6,H1282=$L$9),\"Smart\",\"\")","v":""}]
[711000008200,"LEDWaterproof-P4 L1489-54W-840","TL 2x58W",54,null,8100,100000,"On-Off",""]
[711000008300,"LEDWaterproof-P4 L1489-54W-865","TL 2x58W",54,null,8100,100000,"On-Off",""]
[711000008400,"LEDWaterproof-P4 L1489-70W-840","TL 2x80W",70,null,10500,100000,"On-Off",""]
[711000008500,"LEDWaterproof-P4 L1489-85W-840","2x TLM 140W RS",85,null,12750,100000,"On-Off",""]
[711000008600,"LEDWaterproof-P4 L648-12W-840-EM1","TL 1x18W",12,null,1800,100000,"On-Off",""]
[711000008700,"LEDWaterproof-P4 L648-24W-840-EM1","TL 2x18W",24,null,3600,100000,"On-Off",""]
[711000008800,"LEDWaterproof-P4 L1208-24W-840-EM1","TL 2x18W",24,null,3600,100000,"On-Off",""]
[711000008900,"LEDWaterproof-P4 L1208-24W-840-EM3","TL 2x18W",24,null,3600,100000,"On-Off",""]
[711000009000,"LEDWaterproof-P4 L1208-38W-840-EM1","TL 2x36W",38,null,5700,100000,"On-Off",""]
[711000009100,"LEDWaterproof-P4 L1208-38W-840-EM3","TL 2x36W",38,null,5700,100000,"On-Off",""]
[711000009200,"LEDWaterproof-P4 L1208-38W-865-EM1","TL 2x36W",38,null,5700,100000,"On-Off",""]
[711000009300,"LEDWaterproof-P4 L1208-38W-865-EM3","TL 2x36W",38,null,5700,100000,"On-Off",""]
[711000009400,"LEDWaterproof-P4 L1489-31W-840-EM1","TL 1x58W",31,null,4650,100000,"On-Off",""]
[711000009500,"LEDWaterproof-P4 L1489-31W-840-EM3","TL 1x58W",31,null,4650,100000,"On-Off",""]
[711000009600,"LEDWaterproof-P4 L1489-47W-840-EM1","TL 2x58W",47,null,7050,100000,"On-Off",""]
[711000009700,"LEDWaterproof-P4 L1489-47W-840-EM3","TL 2x58W",47,null,7050,100000,"On-Off",""]
[711000009800,"LEDWaterproof-P4 L1489-54W-840-EM1","TL 2x58W",54,null,8100,100000,"On-Off",""]
[711000009900,"LEDWaterproof-P4 L1489-54W-840-EM3","TL 2x58W",54,null,8100,100000,"On-Off",""]
[711000010000,"LEDWaterproof-P4 L1489-54W-865-EM1","TL 2x58W",54,null,8100,100000,"On-Off",""]
[711000010100,"LEDWaterproof-P4 L1489-54W-865-EM3","TL 2x58W",54,null,8100,100000,"On-Off",""]
[711000010200,"LEDWaterproof-P4 L1208-38W-840-PLUS-EM1","TL 2x36W",38,null,5700,100000,"On-Off",""]
[711000010300,"LEDWaterproof-P4 L1208-38W-840-PLUS-EM3","TL 2x36W",38,null,5700,100000,"On-Off",""]
[711000010400,"LEDWaterproof-P4 L1489-31W-840-PLUS-EM1","TL 1x58W",31,null,4650,100000,"On-Off",""]
[711000010500,"LEDWaterproof-P4 L1489-31W-840-PLUS-EM3","TL 1x58W",31,null,4650,100000,"On-Off",""]
[711000010600,"LEDWaterproof-P4 L1489-54W-840-PLUS-EM1","TL 2x58W",54,null,8100,100000,"On-Off",""]
[711000010700,"LEDWaterproof-P4 L1489-54W-840-PLUS-EM3","TL 2x58W",54,null,8100,100000,"On-Off",""]
[715000002600,"LEDWallSpot-E Rd60-10W-840-24D-BL","Halogen 75W",10,null,800,50000,"On-Off",""]
[715000002800,"LEDWallSpot-E Rd60-10W-830-24D-BL","Halogen 75W",10,null,750,50000,"On-Off",""]
[715000002900,"LEDWallSpot-E Rd60-10W-840-24D-WH","Halogen 75W",10,null,800,50000,"On-Off",""]
[715000003100,"LEDWallSpot-E Rd60-10W-830-24D-WH","Halogen 75W",10,null,750,50000,"On-Off",""]
[715000004000,"LEDWallSpot-E Rd76-20W-830-36D-WH","HID 35W",20,null,2000,50000,"On-Off",""]
[715000004100,"LEDWallSpot-E Rd76-20W-840-36D-WH","HID 35W",20,null,2100,50000,"On-Off",""]
[715000004200,"LEDWallSpot-E Rd76-20W-830-36D-BL","HID 35W",20,null,2000,50000,"On-Off",""]
[715000004300,"LEDWallSpot-E Rd76-20W-840-36D-BL","HID 35W",20,null,2100,50000,"On-Off",""]
[715000006100,"LEDWall-Lucia-E Re135-6W-840-BL","Halogen 60W",6,null,600,50000,"On-Off",""]
[715000006200,"LEDWall-Lucia-E Re175-10W-840-BL","Halogen 80W",10,null,1000,50000,"On-Off",""]
[715000006300,"LEDWall-Lucia-E Re135-6W-830-BL","Halogen 60W",6,null,570,50000,"On-Off",""]
[715000006400,"LEDWall-Lucia-E Re175-10W-830-BL","Halogen 80W",10,null,950,50000,"On-Off",""]
[715000006500,"LEDWall-Lucia-E Re135-6W-840-WH","Halogen 60W",6,null,600,50000,"On-Off",""]
[715000006600,"LEDWall-Lucia-E Re175-10W-840-WH","Halogen 80W",10,null,1000,50000,"On-Off",""]
[715000006700,"LEDWall-Lucia-E Re135-6W-830-WH","Halogen 60W",6,null,570,50000,"On-Off",""]
[715000006800,"LEDWall-Lucia-E Re175-10W-830-WH","Halogen 80W",10,null,950,50000,"On-Off",""]

{"sheet":"Supporting sheet","index":2,"n_rows":53,"n_cols":14,"rows_kept":53,"cut":false,"hidden":true,"merged":[[8,0,8,4],[17,1,17,6]]}
[]
["<Customer name>","<Option 1>"]
["<Project name>","<Option 2>"]
["<Account manager name>","<Option 3>"]
[]
[]
[]
[]
["Comperative Data"]
[null,"Product Code","Lumen Output","Rated Power(W)","Lifetime(H)","Number of Luminaire","instalation costs(total €)","burning hours per year","Annual Output(KWh)","Electricity cost per KWh (€/KWh) ","Annual cost(€)","CO2 Factor","CO2 emission(gram/Y)","Product name"]
["Formulas per cell","<Vlookup>","<Vlookup>","<Vlookup>","<Vlookup>","<formula front page>","<formula front page>","<formula front page>","<power*burn hours>","<formula front page>","<annual output*E.cost>","<formula front page>","<annual output*CO2 factor>"]
["Current"]
["Option 1",{"$f":"'OPPLE TCO Calculation'!D18","v":"Paste/type product code"},{"$f":"VLOOKUP(B13,'PIM export'!A:F,6,FALSE)","v":0},{"$f":"IF(VLOOKUP(B13,'PIM export'!A:E,4,FALSE)=\"\",VLOOKUP(B13,'PIM export'!A:E,5,FALSE),VLOOKUP(B13,'PIM export'!A:E,4,FALSE))","v":0},{"$f":"VLOOKUP(B13,'PIM export'!A:G,7,FALSE)","v":0},{"$f":"'OPPLE TCO Calculation'!D19","v":0},{"$f":"'OPPLE TCO Calculation'!D21","v":0},{"$f":"'OPPLE TCO Calculation'!F6","v":0},{"$f":"IF(VLOOKUP('OPPLE TCO Calculation'!D18,'PIM export'!A:I,9,FALSE)=\"Smart\",(1-'OPPLE TCO Calculation'!I24)*(D13*H13)/1000,(D13*H13)/1000)","v":0},{"$f":"'OPPLE TCO Calculation'!F7","v":0},{"$f":"J13*I13","v":0},{"$f":"'OPPLE TCO Calculation'!F8","v":265},{"$f":"I13*L13","v":0},{"$f":"VLOOKUP(B13,'PIM export'!A:B,2,FALSE)","v":0}]
["Option 2",{"$f":"'OPPLE TCO Calculation'!E18","v":" "},{"$f":"VLOOKUP(B14,'PIM export'!A:F,6,FALSE)","v":0},{"$f":"IF(VLOOKUP(B14,'PIM export'!A:E,4,FALSE)=\"\",VLOOKUP(B14,'PIM export'!A:E,5,FALSE),VLOOKUP(B14,'PIM export'!A:E,4,FALSE))","v":0},{"$f":"VLOOKUP(B14,'PIM export'!A:G,7,FALSE)","v":0},{"$f":"'OPPLE TCO Calculation'!E19","v":0},{"$f":"'OPPLE TCO Calculation'!E21","v":0},{"$f":"'OPPLE TCO Calculation'!F6","v":0},{"$f":"IF(VLOOKUP('OPPLE TCO Calculation'!E18,'PIM export'!A:I,9,FALSE)=\"Smart\",(1-'OPPLE TCO Calculation'!I24)*(D14*H14)/1000,(D14*H14)/1000)","v":0},{"$f":"'OPPLE TCO Calculation'!F7","v":0},{"$f":"J14*I14","v":0},{"$f":"'OPPLE TCO Calculation'!F8","v":265},{"$f":"I14*L14","v":0},{"$f":"VLOOKUP(B14,'PIM export'!A:B,2,FALSE)","v":0}]
["Option 3",{"$f":"'OPPLE TCO Calculation'!F18","v":" "},{"$f":"VLOOKUP(B15,'PIM export'!A:F,6,FALSE)","v":0},{"$f":"IF(VLOOKUP(B15,'PIM export'!A:E,4,FALSE)=\"\",VLOOKUP(B15,'PIM export'!A:E,5,FALSE),VLOOKUP(B15,'PIM export'!A:E,4,FALSE))","v":0},{"$f":"VLOOKUP(B15,'PIM export'!A:G,7,FALSE)","v":0},{"$f":"'OPPLE TCO Calculation'!F19","v":0},{"$f":"'OPPLE TCO Calculation'!F21","v":0},{"$f":"'OPPLE TCO Calculation'!F6","v":0},{"$f":"IF(VLOOKUP('OPPLE TCO Calculation'!F18,'PIM export'!A:I,9,FALSE)=\"Smart\",(1-'OPPLE TCO Calculation'!I24)*(D15*H15)/1000,(D15*H15)/1000)","v":0},{"$f":"'OPPLE TCO Calculation'!F7","v":0},{"$f":"J15*I15","v":0},{"$f":"'OPPLE TCO Calculation'!F8","v":265},{"$f":"I15*L15","v":0},{"$f":"VLOOKUP(B15,'PIM export'!A:B,2,FALSE)","v":0}]
[]
[]
["Return on invest ment","Years",null,null,null,null,null,null,"Opportunities","Payback years","Payback months","Payback period"]
[null,"Fixed cost","Year 1","Year 2","Year 3","Year 4","Year 5",null,{"$f":"'OPPLE TCO Calculation'!B41","v":"Option A"},{"$f":"IF(K24<1,\"\",IF(K24<2,CONCATENATE(K24,\" Year\"),CONCATENATE(K24,\" Years\")))","v":{"$error":"#DIV/0!"}},{"$f":"IF(M24<1,\"\",IF(M24<2,CONCATENATE(M24,\" Month\"),CONCATENATE(M24,\" Months\")))","v":{"$error":"#DIV/0!"}},{"$f":"IF(J19=\"\",K19,IF(K19=\"\",J19,CONCATENATE(J19,\" & \",K19)))","v":{"$error":"#DIV/0!"}}]
["Current system",0,{"$f":"'OPPLE TCO Calculation'!$C$31*1","v":{"$error":"#DIV/0!"}},{"$f":"'OPPLE TCO Calculation'!$C$31*2","v":{"$error":"#DIV/0!"}},{"$f":"'OPPLE TCO Calculation'!$C$31*3","v":{"$error":"#DIV/0!"}},{"$f":"'OPPLE TCO Calculation'!$C$31*4","v":{"$error":"#DIV/0!"}},{"$f":"'OPPLE TCO Calculation'!$C$31*5","v":{"$error":"#DIV/0!"}},null,{"$f":"'OPPLE TCO Calculation'!B42","v":"Option B"},{"$f":"IF(K25<1,\"\",IF(K25<2,CONCATENATE(K25,\" Year\"),CONCATENATE(K25,\" Years\")))","v":{"$error":"#DIV/0!"}},{"$f":"IF(M25<1,\"\",IF(M25<2,CONCATENATE(M25,\" Month\"),CONCATENATE(M25,\" Months\")))","v":{"$error":"#DIV/0!"}},{"$f":"IF(J20=\"\",K20,IF(K20=\"\",J20,CONCATENATE(J20,\" & \",K20)))","v":{"$error":"#DIV/0!"}}]
[{"$f":"'OPPLE TCO Calculation'!$D$17","v":"Option A"},{"$f":"'OPPLE TCO Calculation'!D21+'OPPLE TCO Calculation'!D20*'OPPLE TCO Calculation'!D19","v":0},{"$f":"$B$21+'OPPLE TCO Calculation'!$D$31*1","v":0},{"$f":"$B$21+'OPPLE TCO Calculation'!$D$31*2","v":0},{"$f":"$B$21+'OPPLE TCO Calculation'!$D$31*3","v":0},{"$f":"$B$21+'OPPLE TCO Calculation'!$D$31*4","v":0},{"$f":"$B$21+'OPPLE TCO Calculation'!$D$31*5","v":0},null,{"$f":"'OPPLE TCO Calculation'!B43","v":"Option C"},{"$error":"#DIV/0!"},{"$error":"#DIV/0!"},{"$f":"IF(J21=\"\",K21,IF(K21=\"\",J21,CONCATENATE(J21,\" & \",K21)))","v":{"$error":"#DIV/0!"}}]
[{"$f":"'OPPLE TCO Calculation'!$E$17","v":"Option B"},{"$f":"'OPPLE TCO Calculation'!E21+'OPPLE TCO Calculation'!E20*'OPPLE TCO Calculation'!E19","v":0},{"$f":"$B$22+'OPPLE TCO Calculation'!$E$31*1","v":0},{"$f":"$B$22+'OPPLE TCO Calculation'!$E$31*2","v":0},{"$f":"$B$22+'OPPLE TCO Calculation'!$E$31*3","v":0},{"$f":"$B$22+'OPPLE TCO Calculation'!$E$31*4","v":0},{"$f":"$B$22+'OPPLE TCO Calculation'!$E$31*5","v":0}]
[{"$f":"'OPPLE TCO Calculation'!$F$17","v":"Option C"},{"$f":"'OPPLE TCO Calculation'!F21+'OPPLE TCO Calculation'!F20*'OPPLE TCO Calculation'!F19","v":0},{"$f":"$B$23+'OPPLE TCO Calculation'!$F$31*1","v":0},{"$f":"$B$23+'OPPLE TCO Calculation'!$F$31*2","v":0},{"$f":"$B$23+'OPPLE TCO Calculation'!$F$31*3","v":0},{"$f":"$B$23+'OPPLE TCO Calculation'!$F$31*4","v":0},{"$f":"$B$23+'OPPLE TCO Calculation'!$F$31*5","v":0}]
[null,null,null,null,null,null,null,null,{"$f":"I19","v":"Option A"},{"$f":"('OPPLE TCO Calculation'!D21+('OPPLE TCO Calculation'!D20*'OPPLE TCO Calculation'!D19))/'OPPLE TCO Calculation'!D36","v":{"$error":"#DIV/0!"}},{"$f":"ROUNDDOWN(J24,0)","v":{"$error":"#DIV/0!"}},{"$f":"J24-TRUNC(J24)","v":{"$error":"#DIV/0!"}},{"$f":"ROUNDDOWN((12*L24),0)","v":{"$error":"#DIV/0!"}}]
[null,null,null,null,null,null,null,null,{"$f":"I20","v":"Option B"},{"$f":"('OPPLE TCO Calculation'!E21+('OPPLE TCO Calculation'!E20*'OPPLE TCO Calculation'!E19))/'OPPLE TCO Calculation'!D37","v":{"$error":"#DIV/0!"}},{"$f":"ROUNDDOWN(J25,0)","v":{"$error":"#DIV/0!"}},{"$f":"J25-TRUNC(J25)","v":{"$error":"#DIV/0!"}},{"$f":"ROUNDDOWN((12*L25),0)","v":{"$error":"#DIV/0!"}}]
["OPPLE BLUE",null,null,null,null,null,null,null,"Option C",{"$f":"('OPPLE TCO Calculation'!F21+('OPPLE TCO Calculation'!F20*'OPPLE TCO Calculation'!F19))/'OPPLE TCO Calculation'!D38","v":{"$error":"#DIV/0!"}},{"$error":"#DIV/0!"},{"$f":"J26-TRUNC(J26)","v":{"$error":"#DIV/0!"}},{"$error":"#DIV/0!"}]
["PANTONE 293","255/n_colours = step in Lum!"]
["C96 M77 Y0 K0"]
["R0 G70 B170"]
[]
[]
[]
[]
[]
[]
[null,"Groups"]
[]
[null,"LED Downlight"]
[null,"LED Filament"]
[null,"LED Floodlight"]
[null,"LED Highbay"]
[null,"LED Linear"]
[null,"LED Module"]
[null,"LED Panel"]
[null,"LED Reflector"]
[null,"LED Roadlight"]
[null,"LED Spot"]
[null,"LED Streetlight"]
[null,"LED Trunking"]
[null,"LED Tube"]
[null,"LED Urban"]
[null,"LED Wall and Ceiling Luminaire"]
[null,"LED Waterproof"]

{"sheet":"Equivalents","index":3,"n_rows":40,"n_cols":12,"rows_kept":40,"cut":false,"hidden":true,"merged":[]}
["Equivalent","Wattage (W)","Driver loss (W)","Total W","Optical loss (Lm)","Lamp Lumen Output (Lm)","Lum output (afronden naar beneden)","Lifespan (hours)","Philips merknaam","Link",0]
["Select current system"]
["Custom",{"$f":"'OPPLE TCO Calculation'!I19","v":0},null,{"$f":"B3+C3","v":0},null,{"$f":"'OPPLE TCO Calculation'!I18","v":0},{"$f":"F3","v":0},{"$f":"'OPPLE TCO Calculation'!I20","v":0}]
["TLM 140W RS",140,{"$f":"B4*0.1","v":14},154,0.7,8350,{"$f":"F4*E4","v":5845},15000,"Philips TL-M RS 140W kleur 33-640 1500mm","https://www.firstlight.nl/lampen/gloeilampen/reeds-uitgelopen-artikelen/philips-tl-m-rs-140w-kleur-33-640-1500mm/",0]
["CFL 13W",13,1.3,14.3,0.65,925,{"$f":"F5*E5","v":601.25},15000,"Philips MASTER PL-C 13W - 830 Warm Wit | 2 Pin","https://www.lampdirect.nl/philips-master-pl-c-13w-830-warm-wit-2-pin-8711500620842?channable=404934736b75003837313135303036323038343253&qcd=1&utm_gst=845c787a7373832304df57a6a3564ada408c5d0a&productid=8711500620842&gclid=EAIaIQobChMIqvCQ6Kee-wIVa49oCR07vQe8EAQYASABEgL2MfD_BwE",0]
["CFL 18W",18,1.8,19.8,0.65,1200,780,15000,"Philips MASTER PL-C 18W - 830 Warm Wit | 4 Pin","https://www.lampdirect.nl/philips-master-pl-c-18w-830-warm-wit-4-pin-8711500623331?channable=404934736b75003837313135303036323333333130&qcd=1&utm_gst=6fca77cddbfd664ab9b22b78a99506a0316aaa73&productid=8711500623331&gclid=EAIaIQobChMI_qPl9Kee-wIVi41oCR2UlgU7EAQYAiABEgLb4PD_BwE",0]
["CFL 26W",26,2.6,28.6,0.65,1800,1170,15000,"Philips MASTER PL-C 26W - 830 Warm Wit | 4 Pin","https://www.lampdirect.nl/philips-master-pl-c-26w-830-warm-wit-4-pin-8711500623355?channable=404934736b750038373131353030363233333535b5&qcd=1&utm_gst=ad29e0b8763a5e618dede525df9059bf5d62d173&productid=8711500623355&gclid=EAIaIQobChMI4YjCjqie-wIViOhRCh0PMAVPEAQYASABEgI9l_D_BwE",0]
["CFL 32W",32,3.2,35.200000000000003,0.65,2350,1527.5,15000,"Philips MASTER PL-T 32W - 840 Koel Wit | 4 Pin","https://www.lampdirect.nl/philips-master-pl-t-32w-840-koel-wit-4-pin-8711500611314?channable=404934736b750038373131353030363131333134e2&qcd=1&utm_gst=45efab8263cb6665e06684f86aec61e8fa73995d&productid=8711500611314&gclid=EAIaIQobChMIk6yVi6ee-wIVZ49oCR3BoAj8EAQYAiABEgJ___D_BwE",0]
["CFL 55W",55,5.5,60.5,0.65,4700,3055,15000,"Philips MASTER PL-L 55W - 830 Warm Wit | 4 Pin","https://www.lampdirect.nl/philips-master-pl-l-55w-830-warm-wit-4-pin-8711500615411?channable=404934736b750038373131353030363135343131a0&qcd=1&utm_gst=3c0d57f5ef7a02e8eaefd6b5df404c9bd8466806&productid=8711500615411&gclid=EAIaIQobChMIpdjzl6ie-wIVBJ3VCh3ZcAQoEAQYASABEgJKmvD_BwE",0]
["CFL TC-DD/PL-Q 28W",28,2.8000000000000003,30.8,0.65,2050,1332.5,15000,"Philips PL-Q 28W/830/2P 1CT/10BOX 28 Watt PLQ Lamp - White [ 2 pin ] [Energy Class A]","https://www.amazon.co.uk/Philips-PL-Q-10BOX-Watt-Lamp/dp/B0016PM7FY",0]
["CFL TC-DD/PL-Q 38W",38,3.8000000000000003,41.8,0.65,2850,1852.5,15000,"Philips PL-Q 38W/830/4P 1CT/10BOX 38 Watt PLQ Lamp - White [Energy Class A] [Energy Class A]","https://www.amazon.co.uk/Philips-PL-Q-10BOX-Watt-Lamp/dp/B000ONLRUA/ref=sr_1_2?crid=2HT27WB49AH63&keywords=CFL+TC-DD%2FPL-Q+38W&qid=1667901427&s=lighting&sprefix=cfl+tc-dd%2Fpl-q+38w%2Clighting%2C64&sr=1-2",0]
["GLS 25W",25,{"$f":"B12*0","v":0},25,0.8,250,200,1000,"Osram P CLAS P E27 GLS LED Bulb 2.5 W(25W), 2700K, Warm White, GLS shape","https://nl.rs-online.com/web/p/led-bulbs/1938213",0]
["GLS 40W",40,{"$f":"B13*0","v":0},40,0.8,470,376,1000,"Philips Classic E27 GLS LED Bulb 5.5-40 W(40W), 2700K, Warm White, A60 shape","https://nl.rs-online.com/web/p/led-bulbs/2044195",0]
["GLS 60W",60,{"$f":"B14*0","v":0},60,0.8,806,644.80000000000007,1000,"Philips Classic E27 LED GLS Bulb 5.9 W(60W), 2700K, Warm White, A60 shape","https://nl.rs-online.com/web/p/led-bulbs/2317084",0]
["GLS 75W",75,{"$f":"B15*0","v":0},75,0.8,1055,844,1000,"Philips Classic E27 LED GLS Bulb 7.8 W(75W), 2700K, Warm White, A60 shape","https://nl.rs-online.com/web/p/led-bulbs/2317086","L"]
["GLS 100W",100,{"$f":"B16*0","v":0},100,0.8,1521,1216.8,1000,"Philips Classic E27 LED GLS Bulb 11.2 W(100W), 2700K, Warm White, A60 shape","https://nl.rs-online.com/web/p/led-bulbs/2317087",0]
["Halogen 35W",35,{"$f":"B17*0.1","v":3.5},38.5,1,185,185,2000,"2x Philips Halogeen spot (35W, GU10, warm wit, Blister)","https://www.lamp123.nl/merken/philips/halogeenlampen/detail/17217/2x-philips-halogeen-spot-35w-gu10-warm-wit-blister.html",0]
["Halogen 50W",50,5,55,1,330,330,2000,"Philips Halogeenlamp - 50W - GU10 Fitting - 6 stuks","https://www.bol.com/nl/nl/p/philips-halogeenlamp-50w-gu10-fitting-6-stuks/9200000019517082/",0]
["Halogen 60W",60,6,66,1,840,840,2000,"1 x PHILIPS halogeen 60W E27 helder halogeen halogeenlamp halogeenlamp BT 60 Watt [Energieklasse D]","https://www.amazon.nl/PHILIPS-halogeen-helder-halogeenlamp-Watt/dp/B00A94M3Z2",0]
["Halogen 75W",75,7.5,82.5,1,625,625,2000,"Philips Halogeen GU10 R63 75W - 2 stuks","https://www.bol.com/nl/nl/p/philips-halogeen-gu10-r63-75w-2-stuks/9200000073446836/",0]
["Halogen 80W",80,8,88,1,1415,1415,2000,"Philips Plusline ES Staaflamp R7s 80W 230V - 78mm - Warm Wit","https://www.bol.com/nl/nl/p/philips-plusline-es-staaflamp-r7s-80w-230v-78mm-warm-wit/9200000040574171/",0]
["Halogen 100W",100,10,110,1,2800,2800,2000,"Philips 7724 100W GY6.35 12V","https://www.lampdirect.nl/philips-7724-100w-gy6-35-12v-8711500409850",0]
["HID 35W",35,3.5,38.5,0.8,3150,2520,15000,"Philips MASTERColour G12 CDM-T 35W - 830 Warm Wit","https://www.lampdirect.nl/philips-mastercolour-g12-cdm-t-35w-830-warm-wit-8711500196972?channable=404934736b75003837313135303031393639373215&qcd=1&utm_gst=ca349b6f67af4f3b1f69fea3a34ef02754d07732&productid=8711500196972&gclid=EAIaIQobChMIzujbgKmy-https://www.lampdirect.nl/philips-mastercolour-g12-cdm-t-35w-830-warm-wit-8711500196972?channable=404934736b75003837313135303031393639373215&qcd=1&utm_gst=ca349b6f67af4f3b1f69fea3a34ef02754d07732&productid=8711500196972&gclid=EAIaIQobChMIzujbgKmy-wIVpoODBx3vCgXJEAQYASABEgKtnvD_BwE",0]
["HID 50W",50,5,55,0.8,5400,4320,15000,"Philips MASTERColour G8.5 CDM-TC Elite 50W - 930 Warm Wit | Beste Kleurweergave","https://www.lampdirect.nl/philips-mastercolour-g8-5-cdm-tc-elite-50w-930-warm-wit-beste-kleurweergave-8727900930627?channable=404934736b7500383732373930303933303632370d&qcd=1&utm_gst=60c6d437b4ae5ce159b750195b0e4d3a98c18910&productid=8727900930627&gclid=EAIaIQobChMI6rzMyaO3-wIVxPZ3Ch07Gws6EAQYASABEgIUCvD_BwE",0]
["HID 70W",70,7,77,0.8,6500,5200,15000,"Philips MASTERColour G12 CDM-T 70W - 830 Warm Wit","https://www.lampdirect.nl/philips-mastercolour-g12-cdm-t-70w-830-warm-wit-8711500196996?channable=404934736b7500383731313530303139363939361a&qcd=1&utm_gst=3372fc64ff197df64af954d26f7b9c4b47d1099f&productid=8711500196996&gclid=EAIaIQobChMI8Lih0KO3-wIV1uF3Ch29MQ57EAQYASABEgLe3PD_BwE",0]
["HID 150W",150,15,165,0.8,12500,10000,10500,"Philips MHN-TD RX7S 150W - 842 Koel Wit",null,0,"Seems to be inexistend"]
["HID 250W",250,25,275,0.8,20500,16400,15000,"Philips MASTER HPI-T E40 250W - 645 Koel Wit","https://www.lampdirect.nl/philips-master-hpi-t-e40-250w-645-koel-wit-8711500179890?channable=404934736b75003837313135303031373938393014&qcd=1&utm_gst=4fc0a39f3490a022c1f53e953a431c01af221b0f&productid=8711500179890&gclid=EAIaIQobChMIiuipj6Wy-wIVyQOLCh23FALEEAQYAyABEgK8rvD_BwE",0]
["HID 400W",400,40,440,0.8,32000,25600,15000,"Philips MASTER HPI-T E40 400W - 645 Koel Wit","https://www.lampdirect.nl/philips-master-hpi-t-e40-400w-645-koel-wit-8711500179906?channable=404934736b750038373131353030313739393036d6&qcd=1&utm_gst=54bec8e74b577af36af8b1f088fd840e5db94435&productid=8711500179906&gclid=EAIaIQobChMIiuipj6Wy-wIVyQOLCh23FALEEAQYASABEgKjt_D_BwE",0]
["HID 1000W",1000,100,1100,0.8,82100,65680,15000,"HPI-T 1000W/543 E40 1SL/4","https://www.lighting.philips.nl/prof/conventionele-lampen-en-buizen/hid-lampen/mh-hpi-metaalhalogeen/hpi-t/928482600096_EU/product",0]
["TL 8W",8,0.8,8.8000000000000007,0.7,10000,7000,15000,"Philips LEDtube T5 MASTER (HF) High Efficiency 8W 1000lm - 830 Warm Wit | 55cm - Vervangt 14W","https://www.lampdirect.nl/philips-ledtube-t5-master-hf-high-efficiency-8w-1000lm-830-warm-wit-55cm-vervangt-14w-8718696743232",0]
["TL 9W",9,0.9,9.9,0.7,600,420,15000,"Philips MASTER PL-S 9W - 830 Warm Wit | 2 Pin","https://www.lampdirect.nl/philips-master-pl-s-9w-830-warm-wit-2-pin-8711500260840",0]
["TL 18W",18,1.8,19.8,0.7,1350,944.99999999999989,15000,"Philips MASTER TL - D Super 80 18W - 840 Koel Wit | 60cm","https://www.lampdirect.nl/philips-master-tl-d-super-80-18w-840-koel-wit-60cm-8711500631718?channable=404934736b75003837313135303036333137313807&qcd=1&utm_gst=1dca1324b2d4a395e2c43f7f73168813512f4f50&productid=8711500631718&gclid=EAIaIQobChMIrv7o16my-wIV1eN3Ch2wuwTDEAQYAiABEgJIKPD_BwE",0]
["TL 28W",28,2.8000000000000003,30.8,0.7,2675,1872.4999999999998,15000,"Philips MASTER TL5 HE 28W - 840 Koel Wit | 115cm","https://www.lampdirect.nl/philips-master-tl5-he-28w-840-koel-wit-115cm-8711500639486?channable=404934736b75003837313135303036333934383649&qcd=1&utm_gst=ea87ef24b9fbd849ce12ae700016951761a752cd&productid=8711500639486&gclid=EAIaIQobChMInN6W3amy-wIVV-https://www.lampdirect.nl/philips-master-tl5-he-28w-840-koel-wit-115cm-8711500639486?channable=404934736b75003837313135303036333934383649&qcd=1&utm_gst=ea87ef24b9fbd849ce12ae700016951761a752cd&productid=8711500639486&gclid=EAIaIQobChMInN6W3amy-wIVV-N3Ch3DXg7LEAQYASABEgLIy_D_BwE",0]
["TL 30W",30,3,33,0.7,2400,1680,15000,"Philips MASTER TL - D Super 80 30W - 840 Koel Wit | 90cm","https://www.lampdirect.nl/philips-master-tl-d-super-80-30w-840-koel-wit-90cm-8711500631862?channable=404934736b75003837313135303036333138363244&qcd=1&utm_gst=d914369d2d20f32d242af48a7d452cc979fb6df5&productid=8711500631862&gclid=EAIaIQobChMI6vn44Kmy-wIVgcx3Ch2mYQB1EAQYAiABEgKTKvD_BwE",0]
["TL 35W",35,3.5,38.5,0.7,3315,2320.5,15000,"Philips MASTER TL5 HE 35W - 840 Koel Wit | 145cm","https://www.lampdirect.nl/philips-master-tl5-he-35w-840-koel-wit-145cm-8711500639523",0]
["TL 36W",36,3.6,39.6,0.7,3350,2345,15000,"Philips MASTER TL - D Super 80 36W - 840 Koel Wit | 120cm","https://www.lampdirect.nl/philips-master-tl-d-super-80-36w-840-koel-wit-120cm-8711500632012?channable=404934736b75003837313135303036333230313260&qcd=1&utm_gst=2376066b0eea3899f71ea863368162d286ea1894&productid=8711500632012&gclid=EAIaIQobChMI3ODs5Kmy-wIVCM13Ch2DTQFUEAQYCSABEgK5L_D_BwE",0]
["TL 54W",54,5.4,59.4,0.7,4500,3150,15000,"Philips MASTER TL5 HO 54W - 830 Warm Wit | 115cm","https://www.lampdirect.nl/philips-master-tl5-ho-54w-830-warm-wit-115cm-8711500643162",0]
["TL 58W",58,5.8000000000000007,63.8,0.7,5240,3667.9999999999995,15000,"Philips MASTER TL - D Super 80 58W - 840 Koel Wit | 150cm","https://www.lampdirect.nl/philips-master-tl-d-de-luxe-58w-950-koel-wit-150cm-8711500888716?channable=404934736b750038373131353030383838373136c6&qcd=1&utm_gst=58ebdf27ddd076c5a7995ceb5e054b0eaf43832b&productid=8711500888716&gclid=EAIaIQobChMI3ODs5Kmy-wIVCM13Ch2DTQFUEAQYESABEgLOS_D_BwE",0]
["TL 80W",80,8,88,0.7,6550,4585,15000,"Philips MASTER TL5 HO 80W - 840 Koel Wit | 145cm","https://www.lampdirect.nl/philips-master-tl5-ho-80w-840-koel-wit-145cm-8711500710451",0]
[null,{"$error":"#N/A"},{"$error":"#N/A"},{"$error":"#N/A"},{"$error":"#N/A"},{"$error":"#N/A"},{"$error":"#N/A"},{"$error":"#N/A"}]