{"text_format":"1","workbook":"xlsx","n_sheets":4,"sheets":["OPPLE TCO Calculation","PIM export","Supporting sheet","Equivalents"],"not_rendered":{"charts":4,"images":7,"macros":1,"external_links":0,"defined_names":2,"comments":1,"pivot_tables":0},"unopened":[],"bounds":{"document_bytes":16777216,"sheet_cells":100000,"rows_first":2000,"rows_last":500,"rows_between":2000,"halvings":0,"cell_chars":16384,"cell_head_chars":4096},"cells_cut":0,"cells_raw":0,"read":"whole","date_system":"1900"}

{"sheet":"OPPLE TCO Calculation","index":0,"n_rows":43,"n_cols":9,"rows_kept":43,"cut":false,"hidden":false,"merged":[[40,1,40,2],[41,1,41,2],[42,1,42,2],[39,1,39,2],[22,7,22,8],[15,7,15,8],[15,1,15,5],[35,4,35,5],[36,4,36,5],[37,4,37,5],[35,1,35,2],[36,1,36,2],[37,1,37,2],[34,4,34,5],[34,1,34,2],[33,1,33,5],[9,4,9,5],[9,1,9,2],[1,4,1,5],[22,1,22,5],[14,1,14,5],[6,1,7,2]]}
[]
[null,null,null,null,"Basic project data"]
[null,null,null,null,"Working hours per day",null,null,"Input required"]
[null,null,null,null,"Working days per week",null,null,"Input field"]
[null,null,null,null,"Working weeks per year",null,null,"Automatically generated field"]
[null,null,null,null,"Operating hours per year",{"$f":"F3*F4*F5","v":0},null,"Current sytem"]
[null,"TCO CALCULATION  ",null,null,"Electricity costs (€/kWh)"]
[null,null,null,null,"CO2 factor",265]
[]
[null,"Project information",null,null,"Custom names per alternative"]
[null,"Customer","<Customer name>",null,"Option A"]
[null,"Project","<Project name>",null,"Option B"]
[null,"Account manager","<Account manager name>",null,"Option C"]
[]
[null,"Product specifications"]
[null,"Manual input",null,null,null,null,null,"Custom Current system input"]
[null,null,"Current system",{"$f":"IF(F11=\"\",E11,F11)","v":"Option A"},{"$f":"IF(F12=\"\",E12,F12)","v":"Option B"},{"$f":"IF(F13=\"\",E13,F13)","v":"Option C"},null,"System description",""]
[null,"Product code/type","Select current system","Paste/type product code"," "," ",null,{"$f":"B25","v":"Lumen Output"},0]
[null,"Total number of lamps/luminaires",null,null,null,null,null,{"$f":"B27","v":"Rated Power (incl. driver loss)"},0]
[null,"Price per lamp/luminaire",null,null,null,null,null,{"$f":"B28","v":"Lifetime Burning Hours (L70)"},0]
[null,"Total Installation/relamping costs"]
[]
[null,"Automatic input",null,null,null,null,null,"Smart savings"]
[null,"Product description",{"$f":"IF(C18=\"Custom\",IF(I17=\"\",\"\",I17),C18)","v":"Select current system"},{"$f":"'Supporting sheet'!N13","v":0},{"$f":"'Supporting sheet'!N14","v":0},{"$f":"'Supporting sheet'!N15","v":0},null,"Expected savings due to use of Smart Sensors",0.2]
[null,"Lumen Output",{"$f":"VLOOKUP(C18,Equivalents!A:G,7,FALSE)","v":0},{"$f":"'Supporting sheet'!C13","v":0},{"$f":"'Supporting sheet'!C14","v":0},{"$f":"'Supporting sheet'!C15","v":0}]
[null,"Lumen Output Total",{"$f":"C25*C19","v":0},{"$f":"D25*D19","v":0},{"$f":"E25*E19","v":0},{"$f":"F25*F19","v":0}]
[null,"Rated Power (incl. driver loss)",{"$f":"VLOOKUP(C18,Equivalents!A:F,4,FALSE)","v":0},{"$f":"'Supporting sheet'!D13","v":0},{"$f":"'Supporting sheet'!D14","v":0},{"$f":"'Supporting sheet'!D15","v":0}]
[null,"Lifetime Burning Hours (L70)",{"$f":"VLOOKUP(C18,Equivalents!A:H,8,FALSE)","v":0},{"$f":"'Supporting sheet'!E13","v":0},{"$f":"'Supporting sheet'!E14","v":0},{"$f":"'Supporting sheet'!E15","v":0}]
[null,"Luminaire/lamp lifetime expectancy",{"$f":"C28/F6","v":{"$error":"#DIV/0!"}},{"$f":"D28/F6","v":{"$error":"#DIV/0!"}},{"$f":"E28/F6","v":{"$error":"#DIV/0!"}},{"$f":"F28/F6","v":{"$error":"#DIV/0!"}}]
[null,"Total annual energy consumption",{"$f":"C19*C27*F6/1000","v":0},{"$f":"'Supporting sheet'!I13*D19","v":0},{"$f":"'Supporting sheet'!I14*E19","v":0},{"$f":"'Supporting sheet'!I15*F19","v":0}]
{"$rows_left_out":14}
{"sheet":"PIM export","index":1,"n_rows":1324,"n_cols":12,"rows_kept":1324,"cut":false,"hidden":true,"merged":[]}
["Code","Short description (product)","Equivalent to","Max. system power","Lamp power","Rated luminous flux according to IEC 62722-2-1","Lifetime (L70)","Dimmability","Smart?"]
["Paste/type product code",null,null,null,null,null,null,null,{"$f":"IF(OR(H2=$L$5,H2=$L$6,H2=$L$9),\"Smart\",\"\")","v":""}]
[" ",null,null,null,null,null,null,null,"",null,null,"Dimmability options"]
[140043898,"LED E T5 batten 600 9W 3000K CT","TL 1x18W",9,null,900,40000,"On-Off","",null,null,"1-10V"]
[140043899,"LED E T5 batten 600 9W 4000K CT","TL 1x18W",9,null,950,40000,"On-Off","",null,null,"BLE"]
[140043900,"LED E T5 batten 1200 18W 3000K CT","TL 1x36W",18,null,1850,40000,"On-Off","",null,null,"BLE2"]
[140043901,"LED E T5 batten 1200 18W 4000K CT","TL 1x36W",18,null,1950,40000,"On-Off","",null,null,"DALI"]
[140043902,"LED E T5 batten 900 11W S 3000K BL","TL 1x18W",11,null,1100,40000,"On-Off","",null,null,"DALI2"]
[140043903,"LED E T5 batten 600 9W S 3000K BL","TL 1x18W",9,null,900,40000,"On-Off","",null,null,"DALI2+BLE2"]
[140043904,"LED E T5 batten 300 4.5W S 3000K BL","TL 1x9W",4.5,null,450,40000,"On-Off","",null,null,"On-Off"]
[140043968,"LEDPanelRc-G Sq598-33W-4000-WH-CT","TL 4x18W",33,null,4300,70000,"On-Off","",null,null,"Sensor controlled (MD)"]
[140043971,"LEDPanelRc-G Re298-33W-3000-WH-CT","TL 2x36W",33,null,4200,70000,"On-Off","",null,null,"STEP"]
[140044075,"LED E T5 batten 900 11W S 4000K BL","TL 1x18W",11,null,1200,40000,"On-Off","",null,null,"Triac"]
[140044076,"LED E T5 batten 600 9W S 4000K BL","TL 1x18W",9,null,950,40000,"On-Off",""]
[140044077,"LED E T5 batten 300 4.5W S 4000K BL","TL 1x9W",4.5,null,500,40000,"On-Off",""]
[140044080,"LEDSpotRA-HQ 7W-Dim-3000-40D-AL-CT","Halogen 35W",7,null,420,50000,"Triac",""]
[140044084,"LEDSpotRA-HQ 7W-Dim-4000-40D-AL-CT","Halogen 35W",7,null,450,50000,"Triac",""]
[140044100,"LEDSpotRA-HQ 7W-Dim-4000-40D-WH-CT","Halogen 35W",7,null,450,50000,"Triac",""]
[140044292,"LED E T5 batten 1200 13W S 4000K BL","TL 1x30W",13,null,1400,40000,"On-Off",""]
[140044293,"LED E T5 batten 1200 13W S 3000K BL","TL 1x30W",13,null,1300,40000,"On-Off",""]
[140046181,"LEDPanelRc-G Sq598-33W-DALI-3000-WH-CT","TL 4x18W",33,null,4200,70000,"DALI",""]
[140046182,"LEDPanelRc-G Sq598-33W-DALI-4000-WH-CT","TL 4x18W",33,null,4300,70000,"DALI",""]
[140046185,"LEDPanelRc-G Re298-33W-DALI-3000-WH-CT","TL 2x36W",33,null,4200,70000,"DALI",""]
[140046186,"LEDPanelRc-G Re298-33W-DALI-4000-WH-CT","TL 2x36W",33,null,4300,70000,"DALI",""]
[140046187,"LEDPanelRc-G Re166-21W-DALI-3000-WH-CT","TL 1x36W",21,null,2000,70000,"DALI",""]
[140046188,"LEDPanelRc-G Re166-21W-DALI-4000-WH-CT","TL 1x36W",21,null,2090,70000,"DALI",""]
[140051474,"LEDDownlightRc-HZ R125-7W-Dim-3000-WH","CFL 1x13W",7,null,600,50000,"Triac",""]
[140051477,"LEDDownlightRc-HZ R150-10W-Dim-4000-WH","CFL 1x18W",10,null,900,50000,"Triac",""]
[140051479,"LEDDownlightRc-HZ R175-13W-Dim-4000-WH","CFL 1x26W",13,null,1200,50000,"Triac",""]
[140051481,"LEDDownlightRc-HZ R200-16W-Dim-4000-WH","CFL 1x26W",16,null,1500,50000,"Triac",""]
{"$rows_left_out":1295}
{"sheet":"Supporting sheet","index":2,"n_rows":53,"n_cols":14,"rows_kept":53,"cut":false,"hidden":true,"merged":[[8,0,8,4],[17,1,17,6]]}
[]
["<Customer name>","<Option 1>"]
["<Project name>","<Option 2>"]
["<Account manager name>","<Option 3>"]
[]
[]
[]
[]
["Comperative Data"]
[null,"Product Code","Lumen Output","Rated Power(W)","Lifetime(H)","Number of Luminaire","instalation costs(total €)","burning hours per year","Annual Output(KWh)","Electricity cost per KWh (€/KWh) ","Annual cost(€)","CO2 Factor","CO2 emission(gram/Y)","Product name"]
["Formulas per cell","<Vlookup>","<Vlookup>","<Vlookup>","<Vlookup>","<formula front page>","<formula front page>","<formula front page>","<power*burn hours>","<formula front page>","<annual output*E.cost>","<formula front page>","<annual output*CO2 factor>"]
["Current"]
["Option 1",{"$f":"'OPPLE TCO Calculation'!D18","v":"Paste/type product code"},{"$f":"VLOOKUP(B13,'PIM export'!A:F,6,FALSE)","v":0},{"$f":"IF(VLOOKUP(B13,'PIM export'!A:E,4,FALSE)=\"\",VLOOKUP(B13,'PIM export'!A:E,5,FALSE),VLOOKUP(B13,'PIM export'!A:E,4,FALSE))","v":0},{"$f":"VLOOKUP(B13,'PIM export'!A:G,7,FALSE)","v":0},{"$f":"'OPPLE TCO Calculation'!D19","v":0},{"$f":"'OPPLE TCO Calculation'!D21","v":0},{"$f":"'OPPLE TCO Calculation'!F6","v":0},{"$f":"IF(VLOOKUP('OPPLE TCO Calculation'!D18,'PIM export'!A:I,9,FALSE)=\"Smart\",(1-'OPPLE TCO Calculation'!I24)*(D13*H13)/1000,(D13*H13)/1000)","v":0},{"$f":"'OPPLE TCO Calculation'!F7","v":0},{"$f":"J13*I13","v":0},{"$f":"'OPPLE TCO Calculation'!F8","v":265},{"$f":"I13*L13","v":0},{"$f":"VLOOKUP(B13,'PIM export'!A:B,2,FALSE)","v":0}]
["Option 2",{"$f":"'OPPLE TCO Calculation'!E18","v":" "},{"$f":"VLOOKUP(B14,'PIM export'!A:F,6,FALSE)","v":0},{"$f":"IF(VLOOKUP(B14,'PIM export'!A:E,4,FALSE)=\"\",VLOOKUP(B14,'PIM export'!A:E,5,FALSE),VLOOKUP(B14,'PIM export'!A:E,4,FALSE))","v":0},{"$f":"VLOOKUP(B14,'PIM export'!A:G,7,FALSE)","v":0},{"$f":"'OPPLE TCO Calculation'!E19","v":0},{"$f":"'OPPLE TCO Calculation'!E21","v":0},{"$f":"'OPPLE TCO Calculation'!F6","v":0},{"$f":"IF(VLOOKUP('OPPLE TCO Calculation'!E18,'PIM export'!A:I,9,FALSE)=\"Smart\",(1-'OPPLE TCO Calculation'!I24)*(D14*H14)/1000,(D14*H14)/1000)","v":0},{"$f":"'OPPLE TCO Calculation'!F7","v":0},{"$f":"J14*I14","v":0},{"$f":"'OPPLE TCO Calculation'!F8","v":265},{"$f":"I14*L14","v":0},{"$f":"VLOOKUP(B14,'PIM export'!A:B,2,FALSE)","v":0}]
["Option 3",{"$f":"'OPPLE TCO Calculation'!F18","v":" "},{"$f":"VLOOKUP(B15,'PIM export'!A:F,6,FALSE)","v":0},{"$f":"IF(VLOOKUP(B15,'PIM export'!A:E,4,FALSE)=\"\",VLOOKUP(B15,'PIM export'!A:E,5,FALSE),VLOOKUP(B15,'PIM export'!A:E,4,FALSE))","v":0},{"$f":"VLOOKUP(B15,'PIM export'!A:G,7,FALSE)","v":0},{"$f":"'OPPLE TCO Calculation'!F19","v":0},{"$f":"'OPPLE TCO Calculation'!F21","v":0},{"$f":"'OPPLE TCO Calculation'!F6","v":0},{"$f":"IF(VLOOKUP('OPPLE TCO Calculation'!F18,'PIM export'!A:I,9,FALSE)=\"Smart\",(1-'OPPLE TCO Calculation'!I24)*(D15*H15)/1000,(D15*H15)/1000)","v":0},{"$f":"'OPPLE TCO Calculation'!F7","v":0},{"$f":"J15*I15","v":0},{"$f":"'OPPLE TCO Calculation'!F8","v":265},{"$f":"I15*L15","v":0},{"$f":"VLOOKUP(B15,'PIM export'!A:B,2,FALSE)","v":0}]
[]
[]
["Return on invest ment","Years",null,null,null,null,null,null,"Opportunities","Payback years","Payback months","Payback period"]
[null,"Fixed cost","Year 1","Year 2","Year 3","Year 4","Year 5",null,{"$f":"'OPPLE TCO Calculation'!B41","v":"Option A"},{"$f":"IF(K24<1,\"\",IF(K24<2,CONCATENATE(K24,\" Year\"),CONCATENATE(K24,\" Years\")))","v":{"$error":"#DIV/0!"}},{"$f":"IF(M24<1,\"\",IF(M24<2,CONCATENATE(M24,\" Month\"),CONCATENATE(M24,\" Months\")))","v":{"$error":"#DIV/0!"}},{"$f":"IF(J19=\"\",K19,IF(K19=\"\",J19,CONCATENATE(J19,\" & \",K19)))","v":{"$error":"#DIV/0!"}}]
["Current system",0,{"$f":"'OPPLE TCO Calculation'!$C$31*1","v":{"$error":"#DIV/0!"}},{"$f":"'OPPLE TCO Calculation'!$C$31*2","v":{"$error":"#DIV/0!"}},{"$f":"'OPPLE TCO Calculation'!$C$31*3","v":{"$error":"#DIV/0!"}},{"$f":"'OPPLE TCO Calculation'!$C$31*4","v":{"$error":"#DIV/0!"}},{"$f":"'OPPLE TCO Calculation'!$C$31*5","v":{"$error":"#DIV/0!"}},null,{"$f":"'OPPLE TCO Calculation'!B42","v":"Option B"},{"$f":"IF(K25<1,\"\",IF(K25<2,CONCATENATE(K25,\" Year\"),CONCATENATE(K25,\" Years\")))","v":{"$error":"#DIV/0!"}},{"$f":"IF(M25<1,\"\",IF(M25<2,CONCATENATE(M25,\" Month\"),CONCATENATE(M25,\" Months\")))","v":{"$error":"#DIV/0!"}},{"$f":"IF(J20=\"\",K20,IF(K20=\"\",J20,CONCATENATE(J20,\" & \",K20)))","v":{"$error":"#DIV/0!"}}]
[{"$f":"'OPPLE TCO Calculation'!$D$17","v":"Option A"},{"$f":"'OPPLE TCO Calculation'!D21+'OPPLE TCO Calculation'!D20*'OPPLE TCO Calculation'!D19","v":0},{"$f":"$B$21+'OPPLE TCO Calculation'!$D$31*1","v":0},{"$f":"$B$21+'OPPLE TCO Calculation'!$D$31*2","v":0},{"$f":"$B$21+'OPPLE TCO Calculation'!$D$31*3","v":0},{"$f":"$B$21+'OPPLE TCO Calculation'!$D$31*4","v":0},{"$f":"$B$21+'OPPLE TCO Calculation'!$D$31*5","v":0},null,{"$f":"'OPPLE TCO Calculation'!B43","v":"Option C"},{"$error":"#DIV/0!"},{"$error":"#DIV/0!"},{"$f":"IF(J21=\"\",K21,IF(K21=\"\",J21,CONCATENATE(J21,\" & \",K21)))","v":{"$error":"#DIV/0!"}}]
[{"$f":"'OPPLE TCO Calculation'!$E$17","v":"Option B"},{"$f":"'OPPLE TCO Calculation'!E21+'OPPLE TCO Calculation'!E20*'OPPLE TCO Calculation'!E19","v":0},{"$f":"$B$22+'OPPLE TCO Calculation'!$E$31*1","v":0},{"$f":"$B$22+'OPPLE TCO Calculation'!$E$31*2","v":0},{"$f":"$B$22+'OPPLE TCO Calculation'!$E$31*3","v":0},{"$f":"$B$22+'OPPLE TCO Calculation'!$E$31*4","v":0},{"$f":"$B$22+'OPPLE TCO Calculation'!$E$31*5","v":0}]
[{"$f":"'OPPLE TCO Calculation'!$F$17","v":"Option C"},{"$f":"'OPPLE TCO Calculation'!F21+'OPPLE TCO Calculation'!F20*'OPPLE TCO Calculation'!F19","v":0},{"$f":"$B$23+'OPPLE TCO Calculation'!$F$31*1","v":0},{"$f":"$B$23+'OPPLE TCO Calculation'!$F$31*2","v":0},{"$f":"$B$23+'OPPLE TCO Calculation'!$F$31*3","v":0},{"$f":"$B$23+'OPPLE TCO Calculation'!$F$31*4","v":0},{"$f":"$B$23+'OPPLE TCO Calculation'!$F$31*5","v":0}]
[null,null,null,null,null,null,null,null,{"$f":"I19","v":"Option A"},{"$f":"('OPPLE TCO Calculation'!D21+('OPPLE TCO Calculation'!D20*'OPPLE TCO Calculation'!D19))/'OPPLE TCO Calculation'!D36","v":{"$error":"#DIV/0!"}},{"$f":"ROUNDDOWN(J24,0)","v":{"$error":"#DIV/0!"}},{"$f":"J24-TRUNC(J24)","v":{"$error":"#DIV/0!"}},{"$f":"ROUNDDOWN((12*L24),0)","v":{"$error":"#DIV/0!"}}]
[null,null,null,null,null,null,null,null,{"$f":"I20","v":"Option B"},{"$f":"('OPPLE TCO Calculation'!E21+('OPPLE TCO Calculation'!E20*'OPPLE TCO Calculation'!E19))/'OPPLE TCO Calculation'!D37","v":{"$error":"#DIV/0!"}},{"$f":"ROUNDDOWN(J25,0)","v":{"$error":"#DIV/0!"}},{"$f":"J25-TRUNC(J25)","v":{"$error":"#DIV/0!"}},{"$f":"ROUNDDOWN((12*L25),0)","v":{"$error":"#DIV/0!"}}]
["OPPLE BLUE",null,null,null,null,null,null,null,"Option C",{"$f":"('OPPLE TCO Calculation'!F21+('OPPLE TCO Calculation'!F20*'OPPLE TCO Calculation'!F19))/'OPPLE TCO Calculation'!D38","v":{"$error":"#DIV/0!"}},{"$error":"#DIV/0!"},{"$f":"J26-TRUNC(J26)","v":{"$error":"#DIV/0!"}},{"$error":"#DIV/0!"}]
["PANTONE 293","255/n_colours = step in Lum!"]
["C96 M77 Y0 K0"]
["R0 G70 B170"]
[]
{"$rows_left_out":24}
{"sheet":"Equivalents","index":3,"n_rows":40,"n_cols":12,"rows_kept":40,"cut":false,"hidden":true,"merged":[]}
["Equivalent","Wattage (W)","Driver loss (W)","Total W","Optical loss (Lm)","Lamp Lumen Output (Lm)","Lum output (afronden naar beneden)","Lifespan (hours)","Philips merknaam","Link",0]
["Select current system"]
["Custom",{"$f":"'OPPLE TCO Calculation'!I19","v":0},null,{"$f":"B3+C3","v":0},null,{"$f":"'OPPLE TCO Calculation'!I18","v":0},{"$f":"F3","v":0},{"$f":"'OPPLE TCO Calculation'!I20","v":0}]
["TLM 140W RS",140,{"$f":"B4*0.1","v":14},154,0.7,8350,{"$f":"F4*E4","v":5845},15000,"Philips TL-M RS 140W kleur 33-640 1500mm","https://www.firstlight.nl/lampen/gloeilampen/reeds-uitgelopen-artikelen/philips-tl-m-rs-140w-kleur-33-640-1500mm/",0]
["CFL 13W",13,1.3,14.3,0.65,925,{"$f":"F5*E5","v":601.25},15000,"Philips MASTER PL-C 13W - 830 Warm Wit | 2 Pin","https://www.lampdirect.nl/philips-master-pl-c-13w-830-warm-wit-2-pin-8711500620842?channable=404934736b75003837313135303036323038343253&qcd=1&utm_gst=845c787a7373832304df57a6a3564ada408c5d0a&productid=8711500620842&gclid=EAIaIQobChMIqvCQ6Kee-wIVa49oCR07vQe8EAQYASABEgL2MfD_BwE",0]
["CFL 18W",18,1.8,19.8,0.65,1200,780,15000,"Philips MASTER PL-C 18W - 830 Warm Wit | 4 Pin","https://www.lampdirect.nl/philips-master-pl-c-18w-830-warm-wit-4-pin-8711500623331?channable=404934736b75003837313135303036323333333130&qcd=1&utm_gst=6fca77cddbfd664ab9b22b78a99506a0316aaa73&productid=8711500623331&gclid=EAIaIQobChMI_qPl9Kee-wIVi41oCR2UlgU7EAQYAiABEgLb4PD_BwE",0]
["CFL 26W",26,2.6,28.6,0.65,1800,1170,15000,"Philips MASTER PL-C 26W - 830 Warm Wit | 4 Pin","https://www.lampdirect.nl/philips-master-pl-c-26w-830-warm-wit-4-pin-8711500623355?channable=404934736b750038373131353030363233333535b5&qcd=1&utm_gst=ad29e0b8763a5e618dede525df9059bf5d62d173&productid=8711500623355&gclid=EAIaIQobChMI4YjCjqie-wIViOhRCh0PMAVPEAQYASABEgI9l_D_BwE",0]
["CFL 32W",32,3.2,35.200000000000003,0.65,2350,1527.5,15000,"Philips MASTER PL-T 32W - 840 Koel Wit | 4 Pin","https://www.lampdirect.nl/philips-master-pl-t-32w-840-koel-wit-4-pin-8711500611314?channable=404934736b750038373131353030363131333134e2&qcd=1&utm_gst=45efab8263cb6665e06684f86aec61e8fa73995d&productid=8711500611314&gclid=EAIaIQobChMIk6yVi6ee-wIVZ49oCR3BoAj8EAQYAiABEgJ___D_BwE",0]
["CFL 55W",55,5.5,60.5,0.65,4700,3055,15000,"Philips MASTER PL-L 55W - 830 Warm Wit | 4 Pin","https://www.lampdirect.nl/philips-master-pl-l-55w-830-warm-wit-4-pin-8711500615411?channable=404934736b750038373131353030363135343131a0&qcd=1&utm_gst=3c0d57f5ef7a02e8eaefd6b5df404c9bd8466806&productid=8711500615411&gclid=EAIaIQobChMIpdjzl6ie-wIVBJ3VCh3ZcAQoEAQYASABEgJKmvD_BwE",0]
["CFL TC-DD/PL-Q 28W",28,2.8000000000000003,30.8,0.65,2050,1332.5,15000,"Philips PL-Q 28W/830/2P 1CT/10BOX 28 Watt PLQ Lamp - White [ 2 pin ] [Energy Class A]","https://www.amazon.co.uk/Philips-PL-Q-10BOX-Watt-Lamp/dp/B0016PM7FY",0]
["CFL TC-DD/PL-Q 38W",38,3.8000000000000003,41.8,0.65,2850,1852.5,15000,"Philips PL-Q 38W/830/4P 1CT/10BOX 38 Watt PLQ Lamp - White [Energy Class A] [Energy Class A]","https://www.amazon.co.uk/Philips-PL-Q-10BOX-Watt-Lamp/dp/B000ONLRUA/ref=sr_1_2?crid=2HT27WB49AH63&keywords=CFL+TC-DD%2FPL-Q+38W&qid=1667901427&s=lighting&sprefix=cfl+tc-dd%2Fpl-q+38w%2Clighting%2C64&sr=1-2",0]
["GLS 25W",25,{"$f":"B12*0","v":0},25,0.8,250,200,1000,"Osram P CLAS P E27 GLS LED Bulb 2.5 W(25W), 2700K, Warm White, GLS shape","https://nl.rs-online.com/web/p/led-bulbs/1938213",0]
["GLS 40W",40,{"$f":"B13*0","v":0},40,0.8,470,376,1000,"Philips Classic E27 GLS LED Bulb 5.5-40 W(40W), 2700K, Warm White, A60 shape","https://nl.rs-online.com/web/p/led-bulbs/2044195",0]
["GLS 60W",60,{"$f":"B14*0","v":0},60,0.8,806,644.80000000000007,1000,"Philips Classic E27 LED GLS Bulb 5.9 W(60W), 2700K, Warm White, A60 shape","https://nl.rs-online.com/web/p/led-bulbs/2317084",0]
["GLS 75W",75,{"$f":"B15*0","v":0},75,0.8,1055,844,1000,"Philips Classic E27 LED GLS Bulb 7.8 W(75W), 2700K, Warm White, A60 shape","https://nl.rs-online.com/web/p/led-bulbs/2317086","L"]
["GLS 100W",100,{"$f":"B16*0","v":0},100,0.8,1521,1216.8,1000,"Philips Classic E27 LED GLS Bulb 11.2 W(100W), 2700K, Warm White, A60 shape","https://nl.rs-online.com/web/p/led-bulbs/2317087",0]
["Halogen 35W",35,{"$f":"B17*0.1","v":3.5},38.5,1,185,185,2000,"2x Philips Halogeen spot (35W, GU10, warm wit, Blister)","https://www.lamp123.nl/merken/philips/halogeenlampen/detail/17217/2x-philips-halogeen-spot-35w-gu10-warm-wit-blister.html",0]
["Halogen 50W",50,5,55,1,330,330,2000,"Philips Halogeenlamp - 50W - GU10 Fitting - 6 stuks","https://www.bol.com/nl/nl/p/philips-halogeenlamp-50w-gu10-fitting-6-stuks/9200000019517082/",0]
["Halogen 60W",60,6,66,1,840,840,2000,"1 x PHILIPS halogeen 60W E27 helder halogeen halogeenlamp halogeenlamp BT 60 Watt [Energieklasse D]","https://www.amazon.nl/PHILIPS-halogeen-helder-halogeenlamp-Watt/dp/B00A94M3Z2",0]
["Halogen 75W",75,7.5,82.5,1,625,625,2000,"Philips Halogeen GU10 R63 75W - 2 stuks","https://www.bol.com/nl/nl/p/philips-halogeen-gu10-r63-75w-2-stuks/9200000073446836/",0]
["Halogen 80W",80,8,88,1,1415,1415,2000,"Philips Plusline ES Staaflamp R7s 80W 230V - 78mm - Warm Wit","https://www.bol.com/nl/nl/p/philips-plusline-es-staaflamp-r7s-80w-230v-78mm-warm-wit/9200000040574171/",0]
["Halogen 100W",100,10,110,1,2800,2800,2000,"Philips 7724 100W GY6.35 12V","https://www.lampdirect.nl/philips-7724-100w-gy6-35-12v-8711500409850",0]
["HID 35W",35,3.5,38.5,0.8,3150,2520,15000,"Philips MASTERColour G12 CDM-T 35W - 830 Warm Wit","https://www.lampdirect.nl/philips-mastercolour-g12-cdm-t-35w-830-warm-wit-8711500196972?channable=404934736b75003837313135303031393639373215&qcd=1&utm_gst=ca349b6f67af4f3b1f69fea3a34ef02754d07732&productid=8711500196972&gclid=EAIaIQobChMIzujbgKmy-https://www.lampdirect.nl/philips-mastercolour-g12-cdm-t-35w-830-warm-wit-8711500196972?channable=404934736b75003837313135303031393639373215&qcd=1&utm_gst=ca349b6f67af4f3b1f69fea3a34ef02754d07732&productid=8711500196972&gclid=EAIaIQobChMIzujbgKmy-wIVpoODBx3vCgXJEAQYASABEgKtnvD_BwE",0]
["HID 50W",50,5,55,0.8,5400,4320,15000,"Philips MASTERColour G8.5 CDM-TC Elite 50W - 930 Warm Wit | Beste Kleurweergave","https://www.lampdirect.nl/philips-mastercolour-g8-5-cdm-tc-elite-50w-930-warm-wit-beste-kleurweergave-8727900930627?channable=404934736b7500383732373930303933303632370d&qcd=1&utm_gst=60c6d437b4ae5ce159b750195b0e4d3a98c18910&productid=8727900930627&gclid=EAIaIQobChMI6rzMyaO3-wIVxPZ3Ch07Gws6EAQYASABEgIUCvD_BwE",0]
["HID 70W",70,7,77,0.8,6500,5200,15000,"Philips MASTERColour G12 CDM-T 70W - 830 Warm Wit","https://www.lampdirect.nl/philips-mastercolour-g12-cdm-t-70w-830-warm-wit-8711500196996?channable=404934736b7500383731313530303139363939361a&qcd=1&utm_gst=3372fc64ff197df64af954d26f7b9c4b47d1099f&productid=8711500196996&gclid=EAIaIQobChMI8Lih0KO3-wIV1uF3Ch29MQ57EAQYASABEgLe3PD_BwE",0]
["HID 150W",150,15,165,0.8,12500,10000,10500,"Philips MHN-TD RX7S 150W - 842 Koel Wit",null,0,"Seems to be inexistend"]
["HID 250W",250,25,275,0.8,20500,16400,15000,"Philips MASTER HPI-T E40 250W - 645 Koel Wit","https://www.lampdirect.nl/philips-master-hpi-t-e40-250w-645-koel-wit-8711500179890?channable=404934736b75003837313135303031373938393014&qcd=1&utm_gst=4fc0a39f3490a022c1f53e953a431c01af221b0f&productid=8711500179890&gclid=EAIaIQobChMIiuipj6Wy-wIVyQOLCh23FALEEAQYAyABEgK8rvD_BwE",0]
["HID 400W",400,40,440,0.8,32000,25600,15000,"Philips MASTER HPI-T E40 400W - 645 Koel Wit","https://www.lampdirect.nl/philips-master-hpi-t-e40-400w-645-koel-wit-8711500179906?channable=404934736b750038373131353030313739393036d6&qcd=1&utm_gst=54bec8e74b577af36af8b1f088fd840e5db94435&productid=8711500179906&gclid=EAIaIQobChMIiuipj6Wy-wIVyQOLCh23FALEEAQYASABEgKjt_D_BwE",0]
["HID 1000W",1000,100,1100,0.8,82100,65680,15000,"HPI-T 1000W/543 E40 1SL/4","https://www.lighting.philips.nl/prof/conventionele-lampen-en-buizen/hid-lampen/mh-hpi-metaalhalogeen/hpi-t/928482600096_EU/product",0]
["TL 8W",8,0.8,8.8000000000000007,0.7,10000,7000,15000,"Philips LEDtube T5 MASTER (HF) High Efficiency 8W 1000lm - 830 Warm Wit | 55cm - Vervangt 14W","https://www.lampdirect.nl/philips-ledtube-t5-master-hf-high-efficiency-8w-1000lm-830-warm-wit-55cm-vervangt-14w-8718696743232",0]
{"$rows_left_out":10}